From grad, 11 Months ago, written in Plain Text.
Embed
  1. [ 11%] Building CXX object src/common/CMakeFiles/common.dir/Collision/Management/VMapFactory.cpp.o
  2. [ 11%] Building CXX object src/common/CMakeFiles/common.dir/Collision/Maps/MapTree.cpp.o
  3. [ 11%] Building CXX object src/common/CMakeFiles/common.dir/Banner.cpp.o
  4. [ 11%] Building CXX object src/common/CMakeFiles/common.dir/Common.cpp.o
  5. [ 11%] Building CXX object src/common/CMakeFiles/common.dir/Collision/BoundingIntervalHierarchy.cpp.o
  6. [ 11%] Building CXX object src/common/CMakeFiles/common.dir/Collision/DynamicTree.cpp.o
  7. [ 11%] Building CXX object src/common/CMakeFiles/common.dir/Collision/Management/MMapFactory.cpp.o
  8. [ 11%] Building CXX object src/common/CMakeFiles/common.dir/Collision/Management/VMapManager2.cpp.o
  9. [ 11%] Building CXX object src/common/CMakeFiles/common.dir/Collision/Maps/TileAssembler.cpp.o
  10. [ 11%] Building CXX object src/common/CMakeFiles/common.dir/Collision/Models/GameObjectModel.cpp.o
  11. [ 11%] Building CXX object src/common/CMakeFiles/common.dir/Collision/Models/ModelInstance.cpp.o
  12. In file included from /home/grad/TBC_New/src/common/Logging/Log.h:23,
  13.                  from /home/grad/TBC_New/src/common/Collision/Maps/MapTree.cpp:23:
  14. /home/grad/TBC_New/src/common/Asio/AsioHacksFwd.h:55:15: error: redefinition of default argument for ‘class TimeTraits’
  15.    55 |         class basic_deadline_timer;
  16.       |               ^~~~~~~~~~~~~~~~~~~~
  17. In file included from /home/grad/TBC_New/src/common/Asio/AsioHacksFwd.h:23,
  18.                  from /home/grad/TBC_New/src/common/Logging/Log.h:23,
  19.                  from /home/grad/TBC_New/src/common/Collision/Maps/MapTree.cpp:23:
  20. /usr/include/boost/asio/basic_deadline_timer.hpp:128:5: note: original definition appeared here
  21.   128 |     typename TimeTraits = boost::asio::time_traits<Time>,
  22.       |     ^~~~~~~~
  23. In file included from /home/grad/TBC_New/src/common/Logging/Log.h:23,
  24.                  from /home/grad/TBC_New/src/common/Collision/DynamicTree.cpp:24:
  25. /home/grad/TBC_New/src/common/Asio/AsioHacksFwd.h:55:15: error: redefinition of default argument for ‘class TimeTraits’
  26.    55 |         class basic_deadline_timer;
  27.       |               ^~~~~~~~~~~~~~~~~~~~
  28. In file included from /home/grad/TBC_New/src/common/Asio/AsioHacksFwd.h:23,
  29.                  from /home/grad/TBC_New/src/common/Logging/Log.h:23,
  30.                  from /home/grad/TBC_New/src/common/Collision/DynamicTree.cpp:24:
  31. /usr/include/boost/asio/basic_deadline_timer.hpp:128:5: note: original definition appeared here
  32.   128 |     typename TimeTraits = boost::asio::time_traits<Time>,
  33.       |     ^~~~~~~~
  34. In file included from /home/grad/TBC_New/src/common/Logging/Log.h:23,
  35.                  from /home/grad/TBC_New/src/common/Collision/Management/MMapManager.cpp:20:
  36. /home/grad/TBC_New/src/common/Asio/AsioHacksFwd.h:55:15: error: redefinition of default argument for ‘class TimeTraits’
  37.    55 |         class basic_deadline_timer;
  38.       |               ^~~~~~~~~~~~~~~~~~~~
  39. In file included from /home/grad/TBC_New/src/common/Asio/AsioHacksFwd.h:23,
  40.                  from /home/grad/TBC_New/src/common/Logging/Log.h:23,
  41.                  from /home/grad/TBC_New/src/common/Collision/Management/MMapManager.cpp:20:
  42. /usr/include/boost/asio/basic_deadline_timer.hpp:128:5: note: original definition appeared here
  43.   128 |     typename TimeTraits = boost::asio::time_traits<Time>,
  44.       |     ^~~~~~~~
  45. In file included from /home/grad/TBC_New/src/common/Logging/Log.h:23,
  46.                  from /home/grad/TBC_New/src/common/Collision/Management/VMapManager2.cpp:28:
  47. /home/grad/TBC_New/src/common/Asio/AsioHacksFwd.h:55:15: error: redefinition of default argument for ‘class TimeTraits’
  48.    55 |         class basic_deadline_timer;
  49.       |               ^~~~~~~~~~~~~~~~~~~~
  50. In file included from /home/grad/TBC_New/src/common/Asio/AsioHacksFwd.h:23,
  51.                  from /home/grad/TBC_New/src/common/Logging/Log.h:23,
  52.                  from /home/grad/TBC_New/src/common/Collision/Management/VMapManager2.cpp:28:
  53. /usr/include/boost/asio/basic_deadline_timer.hpp:128:5: note: original definition appeared here
  54.   128 |     typename TimeTraits = boost::asio::time_traits<Time>,
  55.       |     ^~~~~~~~
  56. [ 11%] Building CXX object src/common/CMakeFiles/common.dir/Collision/Models/WorldModel.cpp.o
  57. [ 11%] Building CXX object src/common/CMakeFiles/common.dir/Collision/PrecompiledHeaders/collisionPCH.cpp.o
  58. In file included from /home/grad/TBC_New/src/common/Logging/Log.h:23,
  59.                  from /home/grad/TBC_New/src/common/Collision/Models/GameObjectModel.cpp:26:
  60. /home/grad/TBC_New/src/common/Asio/AsioHacksFwd.h:55:15: error: redefinition of default argument for ‘class TimeTraits’
  61.    55 |         class basic_deadline_timer;
  62.       |               ^~~~~~~~~~~~~~~~~~~~
  63. In file included from /home/grad/TBC_New/src/common/Asio/AsioHacksFwd.h:23,
  64.                  from /home/grad/TBC_New/src/common/Logging/Log.h:23,
  65.                  from /home/grad/TBC_New/src/common/Collision/Models/GameObjectModel.cpp:26:
  66. /usr/include/boost/asio/basic_deadline_timer.hpp:128:5: note: original definition appeared here
  67.   128 |     typename TimeTraits = boost::asio::time_traits<Time>,
  68.       |     ^~~~~~~~
  69. [ 12%] Building CXX object src/common/CMakeFiles/common.dir/Configuration/BuiltInConfig.cpp.o
  70. [ 12%] Building CXX object src/common/CMakeFiles/common.dir/Configuration/Config.cpp.o
  71. make[2]: *** [src/common/CMakeFiles/common.dir/build.make:223: src/common/CMakeFiles/common.dir/Collision/Maps/MapTree.cpp.o] Ошибка 1
  72. make[2]: *** Ожидание завершения заданий…
  73. make[2]: *** [src/common/CMakeFiles/common.dir/build.make:153: src/common/CMakeFiles/common.dir/Collision/DynamicTree.cpp.o] Ошибка 1
  74. make[2]: *** [src/common/CMakeFiles/common.dir/build.make:209: src/common/CMakeFiles/common.dir/Collision/Management/VMapManager2.cpp.o] Ошибка 1
  75. make[2]: *** [src/common/CMakeFiles/common.dir/build.make:181: src/common/CMakeFiles/common.dir/Collision/Management/MMapManager.cpp.o] Ошибка 1
  76. make[2]: *** [src/common/CMakeFiles/common.dir/build.make:251: src/common/CMakeFiles/common.dir/Collision/Models/GameObjectModel.cpp.o] Ошибка 1
  77. In file included from /home/grad/TBC_New/src/common/Logging/Log.h:23,
  78.                  from /home/grad/TBC_New/src/common/Configuration/Config.cpp:25:
  79. /home/grad/TBC_New/src/common/Asio/AsioHacksFwd.h:55:15: error: redefinition of default argument for ‘class TimeTraits’
  80.    55 |         class basic_deadline_timer;
  81.       |               ^~~~~~~~~~~~~~~~~~~~
  82. In file included from /home/grad/TBC_New/src/common/Asio/AsioHacksFwd.h:23,
  83.                  from /home/grad/TBC_New/src/common/Logging/Log.h:23,
  84.                  from /home/grad/TBC_New/src/common/Configuration/Config.cpp:25:
  85. /usr/include/boost/asio/basic_deadline_timer.hpp:128:5: note: original definition appeared here
  86.   128 |     typename TimeTraits = boost::asio::time_traits<Time>,
  87.       |     ^~~~~~~~
  88. make[2]: *** [src/common/CMakeFiles/common.dir/build.make:321: src/common/CMakeFiles/common.dir/Configuration/Config.cpp.o] Ошибка 1
  89. make[1]: *** [CMakeFiles/Makefile2:934: src/common/CMakeFiles/common.dir/all] Ошибка 2
  90. make: *** [Makefile:149: all] Ошибка 2
  91. [email protected]:~/TBC_New/build$
  92.  

A PHP Error was encountered

Severity: Core Warning

Message: PHP Startup: Unable to load dynamic library 'mcrypt.so' (tried: /usr/lib/php/20170718/mcrypt.so (/usr/lib/php/20170718/mcrypt.so: cannot open shared object file: No such file or directory), /usr/lib/php/20170718/mcrypt.so.so (/usr/lib/php/20170718/mcrypt.so.so: cannot open shared object file: No such file or directory))

Filename: Unknown

Line Number: 0

Backtrace: