From grad, 11 Months ago, written in Plain Text.
Embed
  1. [ 10%] Building CXX object src/common/CMakeFiles/common.dir/Collision/Management/VMapManager2.cpp.o
  2. [ 11%] Building CXX object src/common/CMakeFiles/common.dir/Collision/Management/VMapFactory.cpp.o
  3. [ 11%] Building CXX object src/common/CMakeFiles/common.dir/Collision/Management/MMapManager.cpp.o
  4. [ 11%] Building CXX object src/common/CMakeFiles/common.dir/Collision/Maps/MapTree.cpp.o
  5. In file included from /home/grad/TBC_New/src/common/Logging/Log.h:23,
  6.                  from /home/grad/TBC_New/src/common/Collision/DynamicTree.cpp:24:
  7. /home/grad/TBC_New/src/common/Asio/AsioHacksFwd.h:56:3: error: template declaration of ‘typedef’
  8.    56 |   typedef TimeTraits traits_type;
  9.       |   ^~~~~~~
  10. /home/grad/TBC_New/src/common/Asio/AsioHacksFwd.h:57:15: error: template argument required for ‘class basic_deadline_timer’
  11.    57 |         class basic_deadline_timer;
  12.       |               ^~~~~~~~~~~~~~~~~~~~
  13. In file included from /home/grad/TBC_New/src/common/Logging/Log.h:23,
  14.                  from /home/grad/TBC_New/src/common/Collision/Management/VMapManager2.cpp:28:
  15. /home/grad/TBC_New/src/common/Asio/AsioHacksFwd.h:56:3: error: template declaration of ‘typedef’
  16.    56 |   typedef TimeTraits traits_type;
  17.       |   ^~~~~~~
  18. /home/grad/TBC_New/src/common/Asio/AsioHacksFwd.h:57:15: error: template argument required for ‘class basic_deadline_timer’
  19.    57 |         class basic_deadline_timer;
  20.       |               ^~~~~~~~~~~~~~~~~~~~
  21. In file included from /home/grad/TBC_New/src/common/Logging/Log.h:23,
  22.                  from /home/grad/TBC_New/src/common/Collision/Maps/MapTree.cpp:23:
  23. /home/grad/TBC_New/src/common/Asio/AsioHacksFwd.h:56:3: error: template declaration of ‘typedef’
  24.    56 |   typedef TimeTraits traits_type;
  25.       |   ^~~~~~~
  26. /home/grad/TBC_New/src/common/Asio/AsioHacksFwd.h:57:15: error: template argument required for ‘class basic_deadline_timer’
  27.    57 |         class basic_deadline_timer;
  28.       |               ^~~~~~~~~~~~~~~~~~~~
  29. In file included from /home/grad/TBC_New/src/common/Logging/Log.h:23,
  30.                  from /home/grad/TBC_New/src/common/Collision/Management/MMapManager.cpp:20:
  31. /home/grad/TBC_New/src/common/Asio/AsioHacksFwd.h:56:3: error: template declaration of ‘typedef’
  32.    56 |   typedef TimeTraits traits_type;
  33.       |   ^~~~~~~
  34. /home/grad/TBC_New/src/common/Asio/AsioHacksFwd.h:57:15: error: template argument required for ‘class basic_deadline_timer’
  35.    57 |         class basic_deadline_timer;
  36.       |               ^~~~~~~~~~~~~~~~~~~~
  37. [ 11%] Building CXX object src/common/CMakeFiles/common.dir/Collision/Models/GameObjectModel.cpp.o
  38. [ 11%] Building CXX object src/common/CMakeFiles/common.dir/Collision/Maps/TileAssembler.cpp.o
  39. [ 11%] Building CXX object src/common/CMakeFiles/common.dir/Collision/Models/ModelInstance.cpp.o
  40. [ 11%] Building CXX object src/common/CMakeFiles/common.dir/Collision/Models/WorldModel.cpp.o
  41. [ 11%] Building CXX object src/common/CMakeFiles/common.dir/Collision/PrecompiledHeaders/collisionPCH.cpp.o
  42. make[2]: *** [src/common/CMakeFiles/common.dir/build.make:209: src/common/CMakeFiles/common.dir/Collision/Management/VMapManager2.cpp.o] Ошибка 1
  43. make[2]: *** Ожидание завершения заданий…
  44. make[2]: *** [src/common/CMakeFiles/common.dir/build.make:153: src/common/CMakeFiles/common.dir/Collision/DynamicTree.cpp.o] Ошибка 1
  45. make[2]: *** [src/common/CMakeFiles/common.dir/build.make:223: src/common/CMakeFiles/common.dir/Collision/Maps/MapTree.cpp.o] Ошибка 1
  46. In file included from /home/grad/TBC_New/src/common/Logging/Log.h:23,
  47.                  from /home/grad/TBC_New/src/common/Collision/Models/GameObjectModel.cpp:26:
  48. /home/grad/TBC_New/src/common/Asio/AsioHacksFwd.h:56:3: error: template declaration of ‘typedef’
  49.    56 |   typedef TimeTraits traits_type;
  50.       |   ^~~~~~~
  51. /home/grad/TBC_New/src/common/Asio/AsioHacksFwd.h:57:15: error: template argument required for ‘class basic_deadline_timer’
  52.    57 |         class basic_deadline_timer;
  53.       |               ^~~~~~~~~~~~~~~~~~~~
  54. make[2]: *** [src/common/CMakeFiles/common.dir/build.make:181: src/common/CMakeFiles/common.dir/Collision/Management/MMapManager.cpp.o] Ошибка 1
  55. make[2]: *** [src/common/CMakeFiles/common.dir/build.make:251: src/common/CMakeFiles/common.dir/Collision/Models/GameObjectModel.cpp.o] Ошибка 1
  56. make[1]: *** [CMakeFiles/Makefile2:934: src/common/CMakeFiles/common.dir/all] Ошибка 2
  57. make: *** [Makefile:149: all] Ошибка 2
  58.  

A PHP Error was encountered

Severity: Core Warning

Message: PHP Startup: Unable to load dynamic library 'mcrypt.so' (tried: /usr/lib/php/20170718/mcrypt.so (/usr/lib/php/20170718/mcrypt.so: cannot open shared object file: No such file or directory), /usr/lib/php/20170718/mcrypt.so.so (/usr/lib/php/20170718/mcrypt.so.so: cannot open shared object file: No such file or directory))

Filename: Unknown

Line Number: 0

Backtrace: