From grad, 11 Months ago, written in Plain Text.
Embed
  1. [ 11%] Building CXX object src/common/CMakeFiles/common.dir/Collision/Models/GameObjectModel.cpp.o
  2. [ 11%] Building CXX object src/common/CMakeFiles/common.dir/Collision/Models/ModelInstance.cpp.o
  3. In file included from /home/grad/TBC_New/src/common/Logging/Log.h:23,
  4.                  from /home/grad/TBC_New/src/common/Collision/DynamicTree.cpp:24:
  5. /home/grad/TBC_New/src/common/Asio/AsioHacksFwd.h:50:9: error: expected unqualified-id before ‘namespace’
  6.    50 |         namespace ip
  7.       |         ^~~~~~~~~
  8. /home/grad/TBC_New/src/common/Asio/AsioHacksFwd.h:62:22: error: ‘ptime’ does not name a type; did you mean ‘ctime’?
  9.    62 |   typename ErrorSL = ptime,
  10.       |                      ^~~~~
  11.       |                      ctime
  12. /home/grad/TBC_New/src/common/Asio/AsioHacksFwd.h:64:15: error: redefinition of default argument for ‘class ErrorSL’
  13.    64 |         class basic_deadline_timer
  14.       |               ^~~~~~~~~~~~~~~~~~~~
  15. In file included from /home/grad/TBC_New/src/common/Asio/AsioHacksFwd.h:31,
  16.                  from /home/grad/TBC_New/src/common/Logging/Log.h:23,
  17.                  from /home/grad/TBC_New/src/common/Collision/DynamicTree.cpp:24:
  18. /usr/include/boost/asio/basic_deadline_timer.hpp:128:5: note: original definition appeared here
  19.   128 |     typename TimeTraits = boost::asio::time_traits<Time>,
  20.       |     ^~~~~~~~
  21. In file included from /home/grad/TBC_New/src/common/Logging/Log.h:23,
  22.                  from /home/grad/TBC_New/src/common/Collision/DynamicTree.cpp:24:
  23. /home/grad/TBC_New/src/common/Asio/AsioHacksFwd.h:77:36: error: ‘tcp’ was not declared in this scope
  24.    77 |             typedef basic_resolver<tcp> tcp_resolver;
  25.       |                                    ^~~
  26. /home/grad/TBC_New/src/common/Asio/AsioHacksFwd.h:77:39: error: template argument 1 is invalid
  27.    77 |             typedef basic_resolver<tcp> tcp_resolver;
  28.       |                                       ^
  29. In file included from /home/grad/TBC_New/src/common/Logging/Log.h:23,
  30.                  from /home/grad/TBC_New/src/common/Collision/Management/VMapManager2.cpp:28:
  31. /home/grad/TBC_New/src/common/Asio/AsioHacksFwd.h:50:9: error: expected unqualified-id before ‘namespace’
  32.    50 |         namespace ip
  33.       |         ^~~~~~~~~
  34. /home/grad/TBC_New/src/common/Asio/AsioHacksFwd.h:62:22: error: ‘ptime’ does not name a type; did you mean ‘ctime’?
  35.    62 |   typename ErrorSL = ptime,
  36.       |                      ^~~~~
  37.       |                      ctime
  38. /home/grad/TBC_New/src/common/Asio/AsioHacksFwd.h:64:15: error: redefinition of default argument for ‘class ErrorSL’
  39.    64 |         class basic_deadline_timer
  40.       |               ^~~~~~~~~~~~~~~~~~~~
  41. In file included from /home/grad/TBC_New/src/common/Asio/AsioHacksFwd.h:31,
  42.                  from /home/grad/TBC_New/src/common/Logging/Log.h:23,
  43.                  from /home/grad/TBC_New/src/common/Collision/Management/VMapManager2.cpp:28:
  44. /usr/include/boost/asio/basic_deadline_timer.hpp:128:5: note: original definition appeared here
  45.   128 |     typename TimeTraits = boost::asio::time_traits<Time>,
  46.       |     ^~~~~~~~
  47. In file included from /home/grad/TBC_New/src/common/Logging/Log.h:23,
  48.                  from /home/grad/TBC_New/src/common/Collision/Management/VMapManager2.cpp:28:
  49. /home/grad/TBC_New/src/common/Asio/AsioHacksFwd.h:77:36: error: ‘tcp’ was not declared in this scope
  50.    77 |             typedef basic_resolver<tcp> tcp_resolver;
  51.       |                                    ^~~
  52. /home/grad/TBC_New/src/common/Asio/AsioHacksFwd.h:77:39: error: template argument 1 is invalid
  53.    77 |             typedef basic_resolver<tcp> tcp_resolver;
  54.       |                                       ^
  55. In file included from /home/grad/TBC_New/src/common/Logging/Log.h:23,
  56.                  from /home/grad/TBC_New/src/common/Collision/Maps/MapTree.cpp:23:
  57. /home/grad/TBC_New/src/common/Asio/AsioHacksFwd.h:50:9: error: expected unqualified-id before ‘namespace’
  58.    50 |         namespace ip
  59.       |         ^~~~~~~~~
  60. /home/grad/TBC_New/src/common/Asio/AsioHacksFwd.h:62:22: error: ‘ptime’ does not name a type; did you mean ‘ctime’?
  61.    62 |   typename ErrorSL = ptime,
  62.       |                      ^~~~~
  63.       |                      ctime
  64. /home/grad/TBC_New/src/common/Asio/AsioHacksFwd.h:64:15: error: redefinition of default argument for ‘class ErrorSL’
  65.    64 |         class basic_deadline_timer
  66.       |               ^~~~~~~~~~~~~~~~~~~~
  67. In file included from /home/grad/TBC_New/src/common/Asio/AsioHacksFwd.h:31,
  68.                  from /home/grad/TBC_New/src/common/Logging/Log.h:23,
  69.                  from /home/grad/TBC_New/src/common/Collision/Maps/MapTree.cpp:23:
  70. /usr/include/boost/asio/basic_deadline_timer.hpp:128:5: note: original definition appeared here
  71.   128 |     typename TimeTraits = boost::asio::time_traits<Time>,
  72.       |     ^~~~~~~~
  73. In file included from /home/grad/TBC_New/src/common/Logging/Log.h:23,
  74.                  from /home/grad/TBC_New/src/common/Collision/Maps/MapTree.cpp:23:
  75. /home/grad/TBC_New/src/common/Asio/AsioHacksFwd.h:77:36: error: ‘tcp’ was not declared in this scope
  76.    77 |             typedef basic_resolver<tcp> tcp_resolver;
  77.       |                                    ^~~
  78. /home/grad/TBC_New/src/common/Asio/AsioHacksFwd.h:77:39: error: template argument 1 is invalid
  79.    77 |             typedef basic_resolver<tcp> tcp_resolver;
  80.       |                                       ^
  81. [ 11%] Building CXX object src/common/CMakeFiles/common.dir/Collision/Models/WorldModel.cpp.o
  82. In file included from /home/grad/TBC_New/src/common/Logging/Log.h:23,
  83.                  from /home/grad/TBC_New/src/common/Collision/Management/MMapManager.cpp:20:
  84. /home/grad/TBC_New/src/common/Asio/AsioHacksFwd.h:50:9: error: expected unqualified-id before ‘namespace’
  85.    50 |         namespace ip
  86.       |         ^~~~~~~~~
  87. /home/grad/TBC_New/src/common/Asio/AsioHacksFwd.h:62:22: error: ‘ptime’ does not name a type; did you mean ‘ctime’?
  88.    62 |   typename ErrorSL = ptime,
  89.       |                      ^~~~~
  90.       |                      ctime
  91. /home/grad/TBC_New/src/common/Asio/AsioHacksFwd.h:64:15: error: redefinition of default argument for ‘class ErrorSL’
  92.    64 |         class basic_deadline_timer
  93.       |               ^~~~~~~~~~~~~~~~~~~~
  94. In file included from /home/grad/TBC_New/src/common/Asio/AsioHacksFwd.h:31,
  95.                  from /home/grad/TBC_New/src/common/Logging/Log.h:23,
  96.                  from /home/grad/TBC_New/src/common/Collision/Management/MMapManager.cpp:20:
  97. /usr/include/boost/asio/basic_deadline_timer.hpp:128:5: note: original definition appeared here
  98.   128 |     typename TimeTraits = boost::asio::time_traits<Time>,
  99.       |     ^~~~~~~~
  100. In file included from /home/grad/TBC_New/src/common/Logging/Log.h:23,
  101.                  from /home/grad/TBC_New/src/common/Collision/Management/MMapManager.cpp:20:
  102. /home/grad/TBC_New/src/common/Asio/AsioHacksFwd.h:77:36: error: ‘tcp’ was not declared in this scope
  103.    77 |             typedef basic_resolver<tcp> tcp_resolver;
  104.       |                                    ^~~
  105. /home/grad/TBC_New/src/common/Asio/AsioHacksFwd.h:77:39: error: template argument 1 is invalid
  106.    77 |             typedef basic_resolver<tcp> tcp_resolver;
  107.       |                                       ^
  108. [ 11%] Building CXX object src/common/CMakeFiles/common.dir/Collision/PrecompiledHeaders/collisionPCH.cpp.o
  109. In file included from /home/grad/TBC_New/src/common/Logging/Log.h:23,
  110.                  from /home/grad/TBC_New/src/common/Collision/Models/GameObjectModel.cpp:26:
  111. /home/grad/TBC_New/src/common/Asio/AsioHacksFwd.h:50:9: error: expected unqualified-id before ‘namespace’
  112.    50 |         namespace ip
  113.       |         ^~~~~~~~~
  114. /home/grad/TBC_New/src/common/Asio/AsioHacksFwd.h:62:22: error: ‘ptime’ does not name a type; did you mean ‘ctime’?
  115.    62 |   typename ErrorSL = ptime,
  116.       |                      ^~~~~
  117.       |                      ctime
  118. /home/grad/TBC_New/src/common/Asio/AsioHacksFwd.h:64:15: error: redefinition of default argument for ‘class ErrorSL’
  119.    64 |         class basic_deadline_timer
  120.       |               ^~~~~~~~~~~~~~~~~~~~
  121. In file included from /home/grad/TBC_New/src/common/Asio/AsioHacksFwd.h:31,
  122.                  from /home/grad/TBC_New/src/common/Logging/Log.h:23,
  123.                  from /home/grad/TBC_New/src/common/Collision/Models/GameObjectModel.cpp:26:
  124. /usr/include/boost/asio/basic_deadline_timer.hpp:128:5: note: original definition appeared here
  125.   128 |     typename TimeTraits = boost::asio::time_traits<Time>,
  126.       |     ^~~~~~~~
  127. In file included from /home/grad/TBC_New/src/common/Logging/Log.h:23,
  128.                  from /home/grad/TBC_New/src/common/Collision/Models/GameObjectModel.cpp:26:
  129. /home/grad/TBC_New/src/common/Asio/AsioHacksFwd.h:77:36: error: ‘tcp’ was not declared in this scope
  130.    77 |             typedef basic_resolver<tcp> tcp_resolver;
  131.       |                                    ^~~
  132. /home/grad/TBC_New/src/common/Asio/AsioHacksFwd.h:77:39: error: template argument 1 is invalid
  133.    77 |             typedef basic_resolver<tcp> tcp_resolver;
  134.       |                                       ^
  135. [ 12%] Building CXX object src/common/CMakeFiles/common.dir/Configuration/BuiltInConfig.cpp.o
  136. make[2]: *** [src/common/CMakeFiles/common.dir/build.make:153: src/common/CMakeFiles/common.dir/Collision/DynamicTree.cpp.o] Ошибка 1
  137. make[2]: *** Ожидание завершения заданий…
  138. make[2]: *** [src/common/CMakeFiles/common.dir/build.make:209: src/common/CMakeFiles/common.dir/Collision/Management/VMapManager2.cpp.o] Ошибка 1
  139. make[2]: *** [src/common/CMakeFiles/common.dir/build.make:223: src/common/CMakeFiles/common.dir/Collision/Maps/MapTree.cpp.o] Ошибка 1
  140. make[2]: *** [src/common/CMakeFiles/common.dir/build.make:251: src/common/CMakeFiles/common.dir/Collision/Models/GameObjectModel.cpp.o] Ошибка 1
  141. make[2]: *** [src/common/CMakeFiles/common.dir/build.make:181: src/common/CMakeFiles/common.dir/Collision/Management/MMapManager.cpp.o] Ошибка 1
  142. make[1]: *** [CMakeFiles/Makefile2:934: src/common/CMakeFiles/common.dir/all] Ошибка 2
  143. make: *** [Makefile:149: all] Ошибка 2
  144.  

A PHP Error was encountered

Severity: Core Warning

Message: PHP Startup: Unable to load dynamic library 'mcrypt.so' (tried: /usr/lib/php/20170718/mcrypt.so (/usr/lib/php/20170718/mcrypt.so: cannot open shared object file: No such file or directory), /usr/lib/php/20170718/mcrypt.so.so (/usr/lib/php/20170718/mcrypt.so.so: cannot open shared object file: No such file or directory))

Filename: Unknown

Line Number: 0

Backtrace: