From grad, 7 Months ago, written in Plain Text.
Embed
  1. [ 14%] Building CXX object src/common/CMakeFiles/common.dir/Utilities/StartProcess.cpp.o
  2. [ 14%] Building CXX object src/common/CMakeFiles/common.dir/Utilities/TaskScheduler.cpp.o
  3. [ 14%] Building CXX object src/common/CMakeFiles/common.dir/Utilities/Util.cpp.o
  4. [ 14%] Building CXX object src/common/CMakeFiles/common.dir/Debugging/Errors.cpp.o
  5. /home/grad/TBC_New/src/common/Debugging/Errors.cpp:44:38: warning: ‘TrinityAssertionFailedMessage’ initialized and declared ‘extern’
  6.    44 | extern "C" TC_COMMON_API char const* TrinityAssertionFailedMessage = nullptr;
  7.       |                                      ^~~~~~~~~~~~~~~~~~~~~~~~~~~~~
  8. [ 14%] Linking CXX static library libcommon.a
  9. [ 14%] Built target common
  10. [ 14%] Generating CXX prefix source src/server/database/cotire/database_CXX_prefix.cxx
  11. [ 14%] Generating CXX prefix header src/server/database/cotire/database_CXX_prefix.hxx
  12. [ 14%] Building CXX precompiled header src/server/database/cotire/database_CXX_prefix.hxx.gch
  13. Scanning dependencies of target database
  14. [ 14%] Building CXX object src/server/database/CMakeFiles/database.dir/Database/AdhocStatement.cpp.o
  15. [ 14%] Building CXX object src/server/database/CMakeFiles/database.dir/Database/PreparedStatement.cpp.o
  16. [ 14%] Building CXX object src/server/database/CMakeFiles/database.dir/Database/DatabaseWorker.cpp.o
  17. [ 14%] Building CXX object src/server/database/CMakeFiles/database.dir/Database/DatabaseEnv.cpp.o
  18. [ 15%] Building CXX object src/server/database/CMakeFiles/database.dir/Database/QueryCallback.cpp.o
  19. [ 15%] Building CXX object src/server/database/CMakeFiles/database.dir/Database/DatabaseWorkerPool.cpp.o
  20. [ 15%] Building CXX object src/server/database/CMakeFiles/database.dir/Database/MySQLThreading.cpp.o
  21. [ 15%] Building CXX object src/server/database/CMakeFiles/database.dir/Database/DatabaseLoader.cpp.o
  22. [ 15%] Building CXX object src/server/database/CMakeFiles/database.dir/Database/MySQLConnection.cpp.o
  23. [ 15%] Building CXX object src/server/database/CMakeFiles/database.dir/Database/Field.cpp.o
  24. [ 15%] Building CXX object src/server/database/CMakeFiles/database.dir/Database/QueryHolder.cpp.o
  25. [ 15%] Building CXX object src/server/database/CMakeFiles/database.dir/Database/QueryCallbackProcessor.cpp.o
  26. [ 15%] Building CXX object src/server/database/CMakeFiles/database.dir/Database/QueryResult.cpp.o
  27. [ 16%] Building CXX object src/server/database/CMakeFiles/database.dir/Database/Transaction.cpp.o
  28. [ 16%] Building CXX object src/server/database/CMakeFiles/database.dir/Database/Implementation/CharacterDatabase.cpp.o
  29. [ 16%] Building CXX object src/server/database/CMakeFiles/database.dir/Database/Implementation/LoginDatabase.cpp.o
  30. [ 16%] Building CXX object src/server/database/CMakeFiles/database.dir/Database/Implementation/LogsDatabase.cpp.o
  31. [ 16%] Building CXX object src/server/database/CMakeFiles/database.dir/Database/Implementation/WorldDatabase.cpp.o
  32. [ 16%] Building CXX object src/server/database/CMakeFiles/database.dir/Logging/AppenderDB.cpp.o
  33. [ 16%] Building CXX object src/server/database/CMakeFiles/database.dir/Updater/DBUpdater.cpp.o
  34. [ 16%] Building CXX object src/server/database/CMakeFiles/database.dir/Updater/UpdateFetcher.cpp.o
  35. [ 17%] Linking CXX static library libdatabase.a
  36. [ 17%] Built target database
  37. [ 17%] Generating CXX prefix source src/server/shared/cotire/shared_CXX_prefix.cxx
  38. [ 17%] Generating CXX prefix header src/server/shared/cotire/shared_CXX_prefix.hxx
  39. [ 18%] Building CXX precompiled header src/server/shared/cotire/shared_CXX_prefix.hxx.gch
  40. Scanning dependencies of target shared
  41. [ 18%] Building CXX object src/server/shared/CMakeFiles/shared.dir/Realm/Realm.cpp.o
  42. [ 18%] Building CXX object src/server/shared/CMakeFiles/shared.dir/DataStores/DBCStore.cpp.o
  43. [ 18%] Building CXX object src/server/shared/CMakeFiles/shared.dir/Packets/ByteBuffer.cpp.o
  44. [ 18%] Building CXX object src/server/shared/CMakeFiles/shared.dir/DataStores/DBCDatabaseLoader.cpp.o
  45. [ 18%] Building CXX object src/server/shared/CMakeFiles/shared.dir/Realm/RealmList.cpp.o
  46. [ 19%] Linking CXX static library libshared.a
  47. [ 19%] Built target shared
  48. [ 19%] Generating CXX prefix source src/server/authserver/cotire/authserver_CXX_prefix.cxx
  49. [ 19%] Generating CXX prefix source src/server/game/cotire/game_CXX_prefix.cxx
  50. [ 19%] Generating CXX prefix header src/server/authserver/cotire/authserver_CXX_prefix.hxx
  51. [ 19%] Generating CXX prefix source src/server/scripts/cotire/scripts_CXX_prefix.cxx
  52. [ 19%] Generating CXX prefix header src/server/game/cotire/game_CXX_prefix.hxx
  53. [ 19%] Building CXX precompiled header src/server/authserver/cotire/authserver_CXX_prefix.hxx.gch
  54. [ 19%] Generating CXX prefix header src/server/scripts/cotire/scripts_CXX_prefix.hxx
  55. [ 19%] Building CXX precompiled header src/server/game/cotire/game_CXX_prefix.hxx.gch
  56. [ 19%] Building CXX precompiled header src/server/scripts/cotire/scripts_CXX_prefix.hxx.gch
  57. In file included from /home/grad/TBC_New/src/server/game/Entities/Item/Item.h:5,
  58.                  from /home/grad/TBC_New/src/server/game/DataStores/DBCStores.h:7,
  59.                  from /home/grad/TBC_New/src/server/game/PrecompiledHeaders/gamePCH.h:10,
  60.                  from /home/grad/TBC_New/build/src/server/game/cotire/game_CXX_prefix.cxx:4,
  61.                  from /home/grad/TBC_New/build/src/server/game/cotire/game_CXX_prefix.hxx:4:
  62. /home/grad/TBC_New/src/server/game/Entities/Object/Object.h: In member function ‘void WorldObject::VisitNearbyGridObject(const float&, NOTIFIER&) const’:
  63. /home/grad/TBC_New/src/server/game/Entities/Object/Object.h:649:137: error: ‘class Map’ has no member named ‘VisitGrid’
  64.   649 |         template<class NOTIFIER> void VisitNearbyGridObject(float const& radius, NOTIFIER& notifier) const { if (IsInWorld()) GetMap()->VisitGrid(GetPositionX(), GetPositionY(), radius, notifier); }
  65.       |                                                                                                                                         ^~~~~~~~~
  66. /home/grad/TBC_New/src/server/game/Entities/Object/Object.h: In member function ‘void WorldObject::VisitNearbyWorldObject(const float&, NOTIFIER&) const’:
  67. /home/grad/TBC_New/src/server/game/Entities/Object/Object.h:650:138: error: ‘class Map’ has no member named ‘VisitWorld’; did you mean ‘VisitAll’?
  68.   650 |         template<class NOTIFIER> void VisitNearbyWorldObject(float const& radius, NOTIFIER& notifier) const { if (IsInWorld()) GetMap()->VisitWorld(GetPositionX(), GetPositionY(), radius, notifier); }
  69.       |                                                                                                                                          ^~~~~~~~~~
  70.       |                                                                                                                                          VisitAll
  71. In file included from /home/grad/TBC_New/src/server/game/Entities/Unit/Unit.h:5,
  72.                  from /home/grad/TBC_New/src/server/game/Entities/Creature/Creature.h:6,
  73.                  from /home/grad/TBC_New/src/server/game/Globals/ObjectMgr.h:5,
  74.                  from /home/grad/TBC_New/src/server/game/Scripting/ScriptMgr.h:12,
  75.                  from /home/grad/TBC_New/src/server/scripts/ScriptPCH.h:9,
  76.                  from /home/grad/TBC_New/build/src/server/scripts/cotire/scripts_CXX_prefix.cxx:4,
  77.                  from /home/grad/TBC_New/build/src/server/scripts/cotire/scripts_CXX_prefix.hxx:4:
  78. /home/grad/TBC_New/src/server/game/Entities/Object/Object.h: In member function ‘void WorldObject::VisitNearbyGridObject(const float&, NOTIFIER&) const’:
  79. /home/grad/TBC_New/src/server/game/Entities/Object/Object.h:649:137: error: ‘class Map’ has no member named ‘VisitGrid’
  80.   649 |         template<class NOTIFIER> void VisitNearbyGridObject(float const& radius, NOTIFIER& notifier) const { if (IsInWorld()) GetMap()->VisitGrid(GetPositionX(), GetPositionY(), radius, notifier); }
  81.       |                                                                                                                                         ^~~~~~~~~
  82. /home/grad/TBC_New/src/server/game/Entities/Object/Object.h: In member function ‘void WorldObject::VisitNearbyWorldObject(const float&, NOTIFIER&) const’:
  83. /home/grad/TBC_New/src/server/game/Entities/Object/Object.h:650:138: error: ‘class Map’ has no member named ‘VisitWorld’; did you mean ‘VisitAll’?
  84.   650 |         template<class NOTIFIER> void VisitNearbyWorldObject(float const& radius, NOTIFIER& notifier) const { if (IsInWorld()) GetMap()->VisitWorld(GetPositionX(), GetPositionY(), radius, notifier); }
  85.       |                                                                                                                                          ^~~~~~~~~~
  86.       |                                                                                                                                          VisitAll
  87. Scanning dependencies of target authserver
  88. [ 19%] Building CXX object src/server/authserver/CMakeFiles/authserver.dir/Server/AuthSession.cpp.o
  89. [ 19%] Building CXX object src/server/authserver/CMakeFiles/authserver.dir/Authentication/AuthCodes.cpp.o
  90. [ 19%] Building CXX object src/server/authserver/CMakeFiles/authserver.dir/Main.cpp.o
  91. [ 20%] Building CXX object src/server/authserver/CMakeFiles/authserver.dir/Authentication/TOTP.cpp.o
  92. cc1plus: warning: /home/grad/TBC_New/build/src/server/authserver/cotire/authserver_CXX_prefix.hxx.gch: not used because `BOOST_ALL_NO_LIB' is defined [-Winvalid-pch]
  93. cc1plus: warning: /home/grad/TBC_New/build/src/server/authserver/cotire/authserver_CXX_prefix.hxx.gch: not used because `BOOST_ALL_NO_LIB' is defined [-Winvalid-pch]
  94. cc1plus: warning: /home/grad/TBC_New/build/src/server/authserver/cotire/authserver_CXX_prefix.hxx.gch: not used because `BOOST_ALL_NO_LIB' is defined [-Winvalid-pch]
  95. cc1plus: warning: /home/grad/TBC_New/build/src/server/authserver/cotire/authserver_CXX_prefix.hxx.gch: not used because `BOOST_ALL_NO_LIB' is defined [-Winvalid-pch]
  96. CMake Error at /home/grad/TBC_New/dep/cotire/CMake/cotire.cmake:1990 (message):
  97.   cotire: error 1 precompiling
  98.   /home/grad/TBC_New/build/src/server/scripts/cotire/scripts_CXX_prefix.hxx.
  99. Call Stack (most recent call first):
  100.   /home/grad/TBC_New/dep/cotire/CMake/cotire.cmake:3694 (cotire_precompile_prefix_header)
  101.  
  102. CMake Error at /home/grad/TBC_New/dep/cotire/CMake/cotire.cmake:1990 (message):
  103.   cotire: error 1 precompiling
  104.   /home/grad/TBC_New/build/src/server/game/cotire/game_CXX_prefix.hxx.
  105. Call Stack (most recent call first):
  106.   /home/grad/TBC_New/dep/cotire/CMake/cotire.cmake:3694 (cotire_precompile_prefix_header)
  107.  
  108.  
  109.  
  110. make[2]: *** [src/server/game/CMakeFiles/game.dir/build.make:83: src/server/game/cotire/game_CXX_prefix.hxx.gch] Ошибка 1
  111. make[2]: *** [src/server/scripts/CMakeFiles/scripts.dir/build.make:83: src/server/scripts/cotire/scripts_CXX_prefix.hxx.gch] Ошибка 1
  112. make[1]: *** [CMakeFiles/Makefile2:1107: src/server/game/CMakeFiles/game.dir/all] Ошибка 2
  113. make[1]: *** Ожидание завершения заданий…
  114. make[1]: *** [CMakeFiles/Makefile2:1166: src/server/scripts/CMakeFiles/scripts.dir/all] Ошибка 2
  115. [ 20%] Linking CXX executable authserver
  116. [ 20%] Built target authserver
  117. make: *** [Makefile:149: all] Ошибка 2
  118.  

A PHP Error was encountered

Severity: Core Warning

Message: PHP Startup: Unable to load dynamic library 'mcrypt.so' (tried: /usr/lib/php/20170718/mcrypt.so (/usr/lib/php/20170718/mcrypt.so: cannot open shared object file: No such file or directory), /usr/lib/php/20170718/mcrypt.so.so (/usr/lib/php/20170718/mcrypt.so.so: cannot open shared object file: No such file or directory))

Filename: Unknown

Line Number: 0

Backtrace: