From grad, 11 Months ago, written in Plain Text.
Embed
  1.  10%] Building CXX object src/common/CMakeFiles/common.dir/Configuration/Config.cpp.o
  2. [ 10%] Building CXX object src/common/CMakeFiles/common.dir/Collision/Management/VMapManager2.cpp.o
  3. [ 10%] Building CXX object src/common/CMakeFiles/common.dir/Collision/Management/MMapManager.cpp.o
  4. [ 10%] Building CXX object src/common/CMakeFiles/common.dir/Cryptography/HMACSHA1.cpp.o
  5. [ 10%] Building CXX object src/common/CMakeFiles/common.dir/Collision/Maps/MapTree.cpp.o
  6. [ 10%] Building CXX object src/common/CMakeFiles/common.dir/Cryptography/BigNumber.cpp.o
  7. In file included from /home/grad/TBC_New/src/common/Logging/Log.h:23,
  8.                  from /home/grad/TBC_New/src/common/Collision/Models/GameObjectModel.cpp:26:
  9. /home/grad/TBC_New/src/common/Asio/AsioHacksFwd.h:53:15: error: template argument required for ‘class basic_deadline_timer’
  10.    53 |         class basic_deadline_timer;
  11.       |               ^~~~~~~~~~~~~~~~~~~~
  12. [ 10%] Building CXX object src/common/CMakeFiles/common.dir/Cryptography/OpenSSLCrypto.cpp.o
  13. [ 10%] Building CXX object src/common/CMakeFiles/common.dir/Cryptography/Authentication/AuthCrypt.cpp.o
  14. [ 10%] Building CXX object src/common/CMakeFiles/common.dir/Cryptography/SHA1.cpp.o
  15. In file included from /home/grad/TBC_New/src/common/Logging/Log.h:23,
  16.                  from /home/grad/TBC_New/src/common/Collision/DynamicTree.cpp:24:
  17. /home/grad/TBC_New/src/common/Asio/AsioHacksFwd.h:53:15: error: template argument required for ‘class basic_deadline_timer’
  18.    53 |         class basic_deadline_timer;
  19.       |               ^~~~~~~~~~~~~~~~~~~~
  20. In file included from /home/grad/TBC_New/src/common/Logging/Log.h:23,
  21.                  from /home/grad/TBC_New/src/common/Collision/Management/VMapManager2.cpp:28:
  22. /home/grad/TBC_New/src/common/Asio/AsioHacksFwd.h:53:15: error: template argument required for ‘class basic_deadline_timer’
  23.    53 |         class basic_deadline_timer;
  24.       |               ^~~~~~~~~~~~~~~~~~~~
  25. In file included from /home/grad/TBC_New/src/common/Logging/Log.h:23,
  26.                  from /home/grad/TBC_New/src/common/Collision/Maps/MapTree.cpp:23:
  27. /home/grad/TBC_New/src/common/Asio/AsioHacksFwd.h:53:15: error: template argument required for ‘class basic_deadline_timer’
  28.    53 |         class basic_deadline_timer;
  29.       |               ^~~~~~~~~~~~~~~~~~~~
  30. In file included from /home/grad/TBC_New/src/common/Logging/Log.h:23,
  31.                  from /home/grad/TBC_New/src/common/Collision/Management/MMapManager.cpp:20:
  32. /home/grad/TBC_New/src/common/Asio/AsioHacksFwd.h:53:15: error: template argument required for ‘class basic_deadline_timer’
  33.    53 |         class basic_deadline_timer;
  34.       |               ^~~~~~~~~~~~~~~~~~~~
  35. [ 10%] Building CXX object src/common/CMakeFiles/common.dir/DataStores/DBCFileLoader.cpp.o
  36. In file included from /home/grad/TBC_New/src/common/Logging/Log.h:23,
  37.                  from /home/grad/TBC_New/src/common/Configuration/Config.cpp:25:
  38. /home/grad/TBC_New/src/common/Asio/AsioHacksFwd.h:53:15: error: template argument required for ‘class basic_deadline_timer’
  39.    53 |         class basic_deadline_timer;
  40.       |               ^~~~~~~~~~~~~~~~~~~~
  41. [ 11%] Building CXX object src/common/CMakeFiles/common.dir/Logging/Appender.cpp.o
  42. [ 11%] Building CXX object src/common/CMakeFiles/common.dir/Logging/AppenderConsole.cpp.o
  43. In file included from /home/grad/TBC_New/src/common/Logging/Log.h:23,
  44.                  from /home/grad/TBC_New/src/common/Cryptography/Authentication/AuthCrypt.cpp:23:
  45. /home/grad/TBC_New/src/common/Asio/AsioHacksFwd.h:53:15: error: template argument required for ‘class basic_deadline_timer’
  46.    53 |         class basic_deadline_timer;
  47.       |               ^~~~~~~~~~~~~~~~~~~~
  48. make[2]: *** [src/common/CMakeFiles/common.dir/build.make:251: src/common/CMakeFiles/common.dir/Collision/Models/GameObjectModel.cpp.o] Ошибка 1
  49. make[2]: *** Ожидание завершения заданий…
  50. make[2]: *** [src/common/CMakeFiles/common.dir/build.make:209: src/common/CMakeFiles/common.dir/Collision/Management/VMapManager2.cpp.o] Ошибка 1
  51. make[2]: *** [src/common/CMakeFiles/common.dir/build.make:153: src/common/CMakeFiles/common.dir/Collision/DynamicTree.cpp.o] Ошибка 1
  52. make[2]: *** [src/common/CMakeFiles/common.dir/build.make:223: src/common/CMakeFiles/common.dir/Collision/Maps/MapTree.cpp.o] Ошибка 1
  53. make[2]: *** [src/common/CMakeFiles/common.dir/build.make:405: src/common/CMakeFiles/common.dir/Cryptography/Authentication/AuthCrypt.cpp.o] Ошибка 1
  54. make[2]: *** [src/common/CMakeFiles/common.dir/build.make:181: src/common/CMakeFiles/common.dir/Collision/Management/MMapManager.cpp.o] Ошибка 1
  55. make[2]: *** [src/common/CMakeFiles/common.dir/build.make:321: src/common/CMakeFiles/common.dir/Configuration/Config.cpp.o] Ошибка 1
  56. make[1]: *** [CMakeFiles/Makefile2:934: src/common/CMakeFiles/common.dir/all] Ошибка 2
  57. make: *** [Makefile:149: all] Ошибка 2
  58. [email protected]:~/TBC_New/build$ ^C
  59.  

A PHP Error was encountered

Severity: Core Warning

Message: PHP Startup: Unable to load dynamic library 'mcrypt.so' (tried: /usr/lib/php/20170718/mcrypt.so (/usr/lib/php/20170718/mcrypt.so: cannot open shared object file: No such file or directory), /usr/lib/php/20170718/mcrypt.so.so (/usr/lib/php/20170718/mcrypt.so.so: cannot open shared object file: No such file or directory))

Filename: Unknown

Line Number: 0

Backtrace: