From grad, 11 Months ago, written in Plain Text.
Embed
  1. [ 11%] Building CXX object src/common/CMakeFiles/common.dir/Collision/BoundingIntervalHierarchy.cpp.o
  2. [ 11%] Building CXX object src/common/CMakeFiles/common.dir/Collision/Maps/TileAssembler.cpp.o
  3. [ 11%] Building CXX object src/common/CMakeFiles/common.dir/Collision/Models/ModelInstance.cpp.o
  4. [ 11%] Building CXX object src/common/CMakeFiles/common.dir/Collision/Models/GameObjectModel.cpp.o
  5. In file included from /home/grad/TBC_New/src/common/Logging/Log.h:23,
  6.                  from /home/grad/TBC_New/src/common/Collision/Maps/MapTree.cpp:23:
  7. /home/grad/TBC_New/src/common/Asio/AsioHacksFwd.h:55:15: error: redefinition of default argument for ‘class TimeTraits’
  8.    55 |         class basic_deadline_timer;
  9.       |               ^~~~~~~~~~~~~~~~~~~~
  10. In file included from /home/grad/TBC_New/src/common/Asio/AsioHacksFwd.h:23,
  11.                  from /home/grad/TBC_New/src/common/Logging/Log.h:23,
  12.                  from /home/grad/TBC_New/src/common/Collision/Maps/MapTree.cpp:23:
  13. /usr/include/boost/asio/basic_deadline_timer.hpp:128:5: note: original definition appeared here
  14.   128 |     typename TimeTraits = boost::asio::time_traits<Time>,
  15.       |     ^~~~~~~~
  16. In file included from /home/grad/TBC_New/src/common/Logging/Log.h:23,
  17.                  from /home/grad/TBC_New/src/common/Collision/DynamicTree.cpp:24:
  18. /home/grad/TBC_New/src/common/Asio/AsioHacksFwd.h:55:15: error: redefinition of default argument for ‘class TimeTraits’
  19.    55 |         class basic_deadline_timer;
  20.       |               ^~~~~~~~~~~~~~~~~~~~
  21. In file included from /home/grad/TBC_New/src/common/Asio/AsioHacksFwd.h:23,
  22.                  from /home/grad/TBC_New/src/common/Logging/Log.h:23,
  23.                  from /home/grad/TBC_New/src/common/Collision/DynamicTree.cpp:24:
  24. /usr/include/boost/asio/basic_deadline_timer.hpp:128:5: note: original definition appeared here
  25.   128 |     typename TimeTraits = boost::asio::time_traits<Time>,
  26.       |     ^~~~~~~~
  27. In file included from /home/grad/TBC_New/src/common/Logging/Log.h:23,
  28.                  from /home/grad/TBC_New/src/common/Collision/Management/VMapManager2.cpp:28:
  29. /home/grad/TBC_New/src/common/Asio/AsioHacksFwd.h:55:15: error: redefinition of default argument for ‘class TimeTraits’
  30.    55 |         class basic_deadline_timer;
  31.       |               ^~~~~~~~~~~~~~~~~~~~
  32. In file included from /home/grad/TBC_New/src/common/Asio/AsioHacksFwd.h:23,
  33.                  from /home/grad/TBC_New/src/common/Logging/Log.h:23,
  34.                  from /home/grad/TBC_New/src/common/Collision/Management/VMapManager2.cpp:28:
  35. /usr/include/boost/asio/basic_deadline_timer.hpp:128:5: note: original definition appeared here
  36.   128 |     typename TimeTraits = boost::asio::time_traits<Time>,
  37.       |     ^~~~~~~~
  38. In file included from /home/grad/TBC_New/src/common/Logging/Log.h:23,
  39.                  from /home/grad/TBC_New/src/common/Collision/Management/MMapManager.cpp:20:
  40. /home/grad/TBC_New/src/common/Asio/AsioHacksFwd.h:55:15: error: redefinition of default argument for ‘class TimeTraits’
  41.    55 |         class basic_deadline_timer;
  42.       |               ^~~~~~~~~~~~~~~~~~~~
  43. In file included from /home/grad/TBC_New/src/common/Asio/AsioHacksFwd.h:23,
  44.                  from /home/grad/TBC_New/src/common/Logging/Log.h:23,
  45.                  from /home/grad/TBC_New/src/common/Collision/Management/MMapManager.cpp:20:
  46. /usr/include/boost/asio/basic_deadline_timer.hpp:128:5: note: original definition appeared here
  47.   128 |     typename TimeTraits = boost::asio::time_traits<Time>,
  48.       |     ^~~~~~~~
  49. [ 11%] Building CXX object src/common/CMakeFiles/common.dir/Collision/Models/WorldModel.cpp.o
  50. In file included from /home/grad/TBC_New/src/common/Logging/Log.h:23,
  51.                  from /home/grad/TBC_New/src/common/Collision/Models/GameObjectModel.cpp:26:
  52. /home/grad/TBC_New/src/common/Asio/AsioHacksFwd.h:55:15: error: redefinition of default argument for ‘class TimeTraits’
  53.    55 |         class basic_deadline_timer;
  54.       |               ^~~~~~~~~~~~~~~~~~~~
  55. In file included from /home/grad/TBC_New/src/common/Asio/AsioHacksFwd.h:23,
  56.                  from /home/grad/TBC_New/src/common/Logging/Log.h:23,
  57.                  from /home/grad/TBC_New/src/common/Collision/Models/GameObjectModel.cpp:26:
  58. /usr/include/boost/asio/basic_deadline_timer.hpp:128:5: note: original definition appeared here
  59.   128 |     typename TimeTraits = boost::asio::time_traits<Time>,
  60.       |     ^~~~~~~~
  61. [ 11%] Building CXX object src/common/CMakeFiles/common.dir/Collision/PrecompiledHeaders/collisionPCH.cpp.o
  62. [ 12%] Building CXX object src/common/CMakeFiles/common.dir/Configuration/BuiltInConfig.cpp.o
  63. make[2]: *** [src/common/CMakeFiles/common.dir/build.make:153: src/common/CMakeFiles/common.dir/Collision/DynamicTree.cpp.o] Ошибка 1
  64. make[2]: *** Ожидание завершения заданий…
  65. make[2]: *** [src/common/CMakeFiles/common.dir/build.make:223: src/common/CMakeFiles/common.dir/Collision/Maps/MapTree.cpp.o] Ошибка 1
  66. make[2]: *** [src/common/CMakeFiles/common.dir/build.make:209: src/common/CMakeFiles/common.dir/Collision/Management/VMapManager2.cpp.o] Ошибка 1
  67. make[2]: *** [src/common/CMakeFiles/common.dir/build.make:251: src/common/CMakeFiles/common.dir/Collision/Models/GameObjectModel.cpp.o] Ошибка 1
  68. make[2]: *** [src/common/CMakeFiles/common.dir/build.make:181: src/common/CMakeFiles/common.dir/Collision/Management/MMapManager.cpp.o] Ошибка 1
  69. make[1]: *** [CMakeFiles/Makefile2:934: src/common/CMakeFiles/common.dir/all] Ошибка 2
  70. make: *** [Makefile:149: all] Ошибка 2
  71. [email protected]:~/TBC_New/build$
  72.  

A PHP Error was encountered

Severity: Core Warning

Message: PHP Startup: Unable to load dynamic library 'mcrypt.so' (tried: /usr/lib/php/20170718/mcrypt.so (/usr/lib/php/20170718/mcrypt.so: cannot open shared object file: No such file or directory), /usr/lib/php/20170718/mcrypt.so.so (/usr/lib/php/20170718/mcrypt.so.so: cannot open shared object file: No such file or directory))

Filename: Unknown

Line Number: 0

Backtrace: