From kotishe, 8 Months ago, written in Plain Text.
Embed
  1. /root/TBC_New/src/server/game/Entities/Object/Object.h: In member function ‘void WorldObject::VisitNearbyGridObject(const float&, NOTIFIER&) const’:
  2. /root/TBC_New/src/server/game/Entities/Object/Object.h:649:137: error: ‘class Map’ has no member named ‘VisitGrid’; did you mean ‘Visit’?
  3.          template<class NOTIFIER> void VisitNearbyGridObject(float const& radius, NOTIFIER& notifier) const { if (IsInWorld()) GetMap()->VisitGrid(GetPositionX(), GetPositionY(), radius, notifier); }
  4.                                                                                                                                          ^~~~~~~~~
  5.                                                                                                                                          Visit
  6. /root/TBC_New/src/server/game/Entities/Object/Object.h: In member function ‘void WorldObject::VisitNearbyWorldObject(const float&, NOTIFIER&) const’:
  7. /root/TBC_New/src/server/game/Entities/Object/Object.h:650:138: error: ‘class Map’ has no member named ‘VisitWorld’; did you mean ‘VisitAll’?
  8.          template<class NOTIFIER> void VisitNearbyWorldObject(float const& radius, NOTIFIER& notifier) const { if (IsInWorld()) GetMap()->VisitWorld(GetPositionX(), GetPositionY(), radius, notifier); }
  9.                                                                                                                                           ^~~~~~~~~~
  10.                                                                                                                                           VisitAll
  11. In file included from /root/TBC_New/src/server/game/Entities/Unit/Unit.h:5,
  12.                  from /root/TBC_New/src/server/game/Entities/Creature/Creature.h:6,
  13.                  from /root/TBC_New/src/server/game/Globals/ObjectMgr.h:5,
  14.                  from /root/TBC_New/src/server/game/Scripting/ScriptMgr.h:12,
  15.                  from /root/TBC_New/src/server/scripts/ScriptPCH.h:9,
  16.                  from /root/TBC_New/build/src/server/scripts/cotire/scripts_CXX_prefix.cxx:4,
  17.                  from /root/TBC_New/build/src/server/scripts/cotire/scripts_CXX_prefix.hxx:4:
  18. /root/TBC_New/src/server/game/Entities/Object/Object.h: In member function ‘void WorldObject::VisitNearbyGridObject(const float&, NOTIFIER&) const’:
  19. /root/TBC_New/src/server/game/Entities/Object/Object.h:649:137: error: ‘class Map’ has no member named ‘VisitGrid’; did you mean ‘Visit’?
  20.          template<class NOTIFIER> void VisitNearbyGridObject(float const& radius, NOTIFIER& notifier) const { if (IsInWorld()) GetMap()->VisitGrid(GetPositionX(), GetPositionY(), radius, notifier); }
  21.                                                                                                                                          ^~~~~~~~~
  22.                                                                                                                                          Visit
  23. /root/TBC_New/src/server/game/Entities/Object/Object.h: In member function ‘void WorldObject::VisitNearbyWorldObject(const float&, NOTIFIER&) const’:
  24. /root/TBC_New/src/server/game/Entities/Object/Object.h:650:138: error: ‘class Map’ has no member named ‘VisitWorld’; did you mean ‘VisitAll’?
  25.          template<class NOTIFIER> void VisitNearbyWorldObject(float const& radius, NOTIFIER& notifier) const { if (IsInWorld()) GetMap()->VisitWorld(GetPositionX(), GetPositionY(), radius, notifier); }
  26.                                                                                                                                           ^~~~~~~~~~
  27.                                                                                                                                           VisitAll
  28. CMake Error at /root/TBC_New/dep/cotire/CMake/cotire.cmake:1990 (message):
  29.   cotire: error 1 precompiling
  30.   /root/TBC_New/build/src/server/game/cotire/game_CXX_prefix.hxx.
  31. Call Stack (most recent call first):
  32.   /root/TBC_New/dep/cotire/CMake/cotire.cmake:3694 (cotire_precompile_prefix_header)
  33.  
  34.  
  35. make[2]: *** [src/server/game/CMakeFiles/game.dir/build.make:64: src/server/game/cotire/game_CXX_prefix.hxx.gch] Ошибка 1
  36. make[1]: *** [CMakeFiles/Makefile2:1118: src/server/game/CMakeFiles/game.dir/all] Ошибка 2
  37. make[1]: *** Ожидание завершения заданий…
  38. CMake Error at /root/TBC_New/dep/cotire/CMake/cotire.cmake:1990 (message):
  39.   cotire: error 1 precompiling
  40.   /root/TBC_New/build/src/server/scripts/cotire/scripts_CXX_prefix.hxx.
  41. Call Stack (most recent call first):
  42.   /root/TBC_New/dep/cotire/CMake/cotire.cmake:3694 (cotire_precompile_prefix_header)
  43.  
  44.  
  45. make[2]: *** [src/server/scripts/CMakeFiles/scripts.dir/build.make:64: src/server/scripts/cotire/scripts_CXX_prefix.hxx.gch] Ошибка 1
  46.  

A PHP Error was encountered

Severity: Core Warning

Message: PHP Startup: Unable to load dynamic library 'mcrypt.so' (tried: /usr/lib/php/20170718/mcrypt.so (/usr/lib/php/20170718/mcrypt.so: cannot open shared object file: No such file or directory), /usr/lib/php/20170718/mcrypt.so.so (/usr/lib/php/20170718/mcrypt.so.so: cannot open shared object file: No such file or directory))

Filename: Unknown

Line Number: 0

Backtrace: