From grad, 11 Months ago, written in Plain Text.
Embed
  1. [ 11%] Building CXX object src/common/CMakeFiles/common.dir/Collision/Maps/MapTree.cpp.o
  2. [ 11%] Building CXX object src/common/CMakeFiles/common.dir/Collision/Maps/TileAssembler.cpp.o
  3. [ 11%] Building CXX object src/common/CMakeFiles/common.dir/Collision/Models/GameObjectModel.cpp.o
  4. [ 11%] Building CXX object src/common/CMakeFiles/common.dir/Collision/Models/ModelInstance.cpp.o
  5. In file included from /home/grad/TBC_New/src/common/Logging/Log.h:23,
  6.                  from /home/grad/TBC_New/src/common/Collision/DynamicTree.cpp:24:
  7. /home/grad/TBC_New/src/common/Asio/AsioHacksFwd.h:49:13: error: declaration of template parameter ‘Time’ shadows template parameter
  8.    49 |   template <typename Time,
  9.       |             ^~~~~~~~
  10. /home/grad/TBC_New/src/common/Asio/AsioHacksFwd.h:48:19: note: template parameter ‘Time’ declared here
  11.    48 |         template <typename Time>
  12.       |                   ^~~~~~~~
  13. /home/grad/TBC_New/src/common/Asio/AsioHacksFwd.h:50:31: error: ‘ctime’ does not name a type
  14.    50 |   typename ExecutionContext = ctime,
  15.       |                               ^~~~~
  16. /home/grad/TBC_New/src/common/Asio/AsioHacksFwd.h:52:15: error: too many template-parameter-lists
  17.    52 |         class basic_deadline_timer
  18.       |               ^~~~~~~~~~~~~~~~~~~~
  19. In file included from /home/grad/TBC_New/src/common/Logging/Log.h:23,
  20.                  from /home/grad/TBC_New/src/common/Collision/Maps/MapTree.cpp:23:
  21. /home/grad/TBC_New/src/common/Asio/AsioHacksFwd.h:49:13: error: declaration of template parameter ‘Time’ shadows template parameter
  22.    49 |   template <typename Time,
  23.       |             ^~~~~~~~
  24. /home/grad/TBC_New/src/common/Asio/AsioHacksFwd.h:48:19: note: template parameter ‘Time’ declared here
  25.    48 |         template <typename Time>
  26.       |                   ^~~~~~~~
  27. /home/grad/TBC_New/src/common/Asio/AsioHacksFwd.h:50:31: error: ‘ctime’ does not name a type
  28.    50 |   typename ExecutionContext = ctime,
  29.       |                               ^~~~~
  30. /home/grad/TBC_New/src/common/Asio/AsioHacksFwd.h:52:15: error: too many template-parameter-lists
  31.    52 |         class basic_deadline_timer
  32.       |               ^~~~~~~~~~~~~~~~~~~~
  33. In file included from /home/grad/TBC_New/src/common/Logging/Log.h:23,
  34.                  from /home/grad/TBC_New/src/common/Collision/Management/VMapManager2.cpp:28:
  35. /home/grad/TBC_New/src/common/Asio/AsioHacksFwd.h:49:13: error: declaration of template parameter ‘Time’ shadows template parameter
  36.    49 |   template <typename Time,
  37.       |             ^~~~~~~~
  38. /home/grad/TBC_New/src/common/Asio/AsioHacksFwd.h:48:19: note: template parameter ‘Time’ declared here
  39.    48 |         template <typename Time>
  40.       |                   ^~~~~~~~
  41. /home/grad/TBC_New/src/common/Asio/AsioHacksFwd.h:50:31: error: ‘ctime’ does not name a type
  42.    50 |   typename ExecutionContext = ctime,
  43.       |                               ^~~~~
  44. /home/grad/TBC_New/src/common/Asio/AsioHacksFwd.h:52:15: error: too many template-parameter-lists
  45.    52 |         class basic_deadline_timer
  46.       |               ^~~~~~~~~~~~~~~~~~~~
  47. [ 11%] Building CXX object src/common/CMakeFiles/common.dir/Collision/Models/WorldModel.cpp.o
  48. In file included from /home/grad/TBC_New/src/common/Logging/Log.h:23,
  49.                  from /home/grad/TBC_New/src/common/Collision/Management/MMapManager.cpp:20:
  50. /home/grad/TBC_New/src/common/Asio/AsioHacksFwd.h:49:13: error: declaration of template parameter ‘Time’ shadows template parameter
  51.    49 |   template <typename Time,
  52.       |             ^~~~~~~~
  53. /home/grad/TBC_New/src/common/Asio/AsioHacksFwd.h:48:19: note: template parameter ‘Time’ declared here
  54.    48 |         template <typename Time>
  55.       |                   ^~~~~~~~
  56. /home/grad/TBC_New/src/common/Asio/AsioHacksFwd.h:50:31: error: ‘ctime’ does not name a type
  57.    50 |   typename ExecutionContext = ctime,
  58.       |                               ^~~~~
  59. /home/grad/TBC_New/src/common/Asio/AsioHacksFwd.h:52:15: error: too many template-parameter-lists
  60.    52 |         class basic_deadline_timer
  61.       |               ^~~~~~~~~~~~~~~~~~~~
  62. In file included from /home/grad/TBC_New/src/common/Logging/Log.h:23,
  63.                  from /home/grad/TBC_New/src/common/Collision/Models/GameObjectModel.cpp:26:
  64. /home/grad/TBC_New/src/common/Asio/AsioHacksFwd.h:49:13: error: declaration of template parameter ‘Time’ shadows template parameter
  65.    49 |   template <typename Time,
  66.       |             ^~~~~~~~
  67. /home/grad/TBC_New/src/common/Asio/AsioHacksFwd.h:48:19: note: template parameter ‘Time’ declared here
  68.    48 |         template <typename Time>
  69.       |                   ^~~~~~~~
  70. /home/grad/TBC_New/src/common/Asio/AsioHacksFwd.h:50:31: error: ‘ctime’ does not name a type
  71.    50 |   typename ExecutionContext = ctime,
  72.       |                               ^~~~~
  73. /home/grad/TBC_New/src/common/Asio/AsioHacksFwd.h:52:15: error: too many template-parameter-lists
  74.    52 |         class basic_deadline_timer
  75.       |               ^~~~~~~~~~~~~~~~~~~~
  76. [ 11%] Building CXX object src/common/CMakeFiles/common.dir/Collision/PrecompiledHeaders/collisionPCH.cpp.o
  77. [ 12%] Building CXX object src/common/CMakeFiles/common.dir/Configuration/BuiltInConfig.cpp.o
  78. make[2]: *** [src/common/CMakeFiles/common.dir/build.make:153: src/common/CMakeFiles/common.dir/Collision/DynamicTree.cpp.o] Ошибка 1
  79. make[2]: *** Ожидание завершения заданий…
  80. make[2]: *** [src/common/CMakeFiles/common.dir/build.make:223: src/common/CMakeFiles/common.dir/Collision/Maps/MapTree.cpp.o] Ошибка 1
  81. make[2]: *** [src/common/CMakeFiles/common.dir/build.make:209: src/common/CMakeFiles/common.dir/Collision/Management/VMapManager2.cpp.o] Ошибка 1
  82. make[2]: *** [src/common/CMakeFiles/common.dir/build.make:251: src/common/CMakeFiles/common.dir/Collision/Models/GameObjectModel.cpp.o] Ошибка 1
  83. make[2]: *** [src/common/CMakeFiles/common.dir/build.make:181: src/common/CMakeFiles/common.dir/Collision/Management/MMapManager.cpp.o] Ошибка 1
  84. make[1]: *** [CMakeFiles/Makefile2:934: src/common/CMakeFiles/common.dir/all] Ошибка 2
  85. make: *** [Makefile:149: all] Ошибка 2
  86.  

A PHP Error was encountered

Severity: Core Warning

Message: PHP Startup: Unable to load dynamic library 'mcrypt.so' (tried: /usr/lib/php/20170718/mcrypt.so (/usr/lib/php/20170718/mcrypt.so: cannot open shared object file: No such file or directory), /usr/lib/php/20170718/mcrypt.so.so (/usr/lib/php/20170718/mcrypt.so.so: cannot open shared object file: No such file or directory))

Filename: Unknown

Line Number: 0

Backtrace: