From grad, 11 Months ago, written in Plain Text.
Embed
  1. [ 11%] Building CXX object src/common/CMakeFiles/common.dir/Collision/Maps/TileAssembler.cpp.o
  2. [ 11%] Building CXX object src/common/CMakeFiles/common.dir/Collision/Models/GameObjectModel.cpp.o
  3. [ 11%] Building CXX object src/common/CMakeFiles/common.dir/Collision/Models/ModelInstance.cpp.o
  4. In file included from /home/grad/TBC_New/src/common/Logging/Log.h:23,
  5.                  from /home/grad/TBC_New/src/common/Collision/DynamicTree.cpp:24:
  6. /home/grad/TBC_New/src/common/Asio/AsioHacksFwd.h:55:15: error: redefinition of default argument for ‘class TimeTraits’
  7.    55 |         class basic_deadline_timer;
  8.       |               ^~~~~~~~~~~~~~~~~~~~
  9. In file included from /home/grad/TBC_New/src/common/Asio/AsioHacksFwd.h:23,
  10.                  from /home/grad/TBC_New/src/common/Logging/Log.h:23,
  11.                  from /home/grad/TBC_New/src/common/Collision/DynamicTree.cpp:24:
  12. /usr/include/boost/asio/basic_deadline_timer.hpp:128:5: note: original definition appeared here
  13.   128 |     typename TimeTraits = boost::asio::time_traits<Time>,
  14.       |     ^~~~~~~~
  15. In file included from /home/grad/TBC_New/src/common/Logging/Log.h:23,
  16.                  from /home/grad/TBC_New/src/common/Collision/DynamicTree.cpp:24:
  17. /home/grad/TBC_New/src/common/Asio/AsioHacksFwd.h:56:17: error: ‘TimeTraits’ does not name a type; did you mean ‘time_traits’?
  18.    56 |         typedef TimeTraits traits_type;
  19.       |                 ^~~~~~~~~~
  20.       |                 time_traits
  21. In file included from /home/grad/TBC_New/src/common/Logging/Log.h:23,
  22.                  from /home/grad/TBC_New/src/common/Collision/Maps/MapTree.cpp:23:
  23. /home/grad/TBC_New/src/common/Asio/AsioHacksFwd.h:55:15: error: redefinition of default argument for ‘class TimeTraits’
  24.    55 |         class basic_deadline_timer;
  25.       |               ^~~~~~~~~~~~~~~~~~~~
  26. In file included from /home/grad/TBC_New/src/common/Asio/AsioHacksFwd.h:23,
  27.                  from /home/grad/TBC_New/src/common/Logging/Log.h:23,
  28.                  from /home/grad/TBC_New/src/common/Collision/Maps/MapTree.cpp:23:
  29. /usr/include/boost/asio/basic_deadline_timer.hpp:128:5: note: original definition appeared here
  30.   128 |     typename TimeTraits = boost::asio::time_traits<Time>,
  31.       |     ^~~~~~~~
  32. In file included from /home/grad/TBC_New/src/common/Logging/Log.h:23,
  33.                  from /home/grad/TBC_New/src/common/Collision/Maps/MapTree.cpp:23:
  34. /home/grad/TBC_New/src/common/Asio/AsioHacksFwd.h:56:17: error: ‘TimeTraits’ does not name a type; did you mean ‘time_traits’?
  35.    56 |         typedef TimeTraits traits_type;
  36.       |                 ^~~~~~~~~~
  37.       |                 time_traits
  38. In file included from /home/grad/TBC_New/src/common/Logging/Log.h:23,
  39.                  from /home/grad/TBC_New/src/common/Collision/Management/VMapManager2.cpp:28:
  40. /home/grad/TBC_New/src/common/Asio/AsioHacksFwd.h:55:15: error: redefinition of default argument for ‘class TimeTraits’
  41.    55 |         class basic_deadline_timer;
  42.       |               ^~~~~~~~~~~~~~~~~~~~
  43. In file included from /home/grad/TBC_New/src/common/Asio/AsioHacksFwd.h:23,
  44.                  from /home/grad/TBC_New/src/common/Logging/Log.h:23,
  45.                  from /home/grad/TBC_New/src/common/Collision/Management/VMapManager2.cpp:28:
  46. /usr/include/boost/asio/basic_deadline_timer.hpp:128:5: note: original definition appeared here
  47.   128 |     typename TimeTraits = boost::asio::time_traits<Time>,
  48.       |     ^~~~~~~~
  49. In file included from /home/grad/TBC_New/src/common/Logging/Log.h:23,
  50.                  from /home/grad/TBC_New/src/common/Collision/Management/VMapManager2.cpp:28:
  51. /home/grad/TBC_New/src/common/Asio/AsioHacksFwd.h:56:17: error: ‘TimeTraits’ does not name a type; did you mean ‘time_traits’?
  52.    56 |         typedef TimeTraits traits_type;
  53.       |                 ^~~~~~~~~~
  54.       |                 time_traits
  55. In file included from /home/grad/TBC_New/src/common/Logging/Log.h:23,
  56.                  from /home/grad/TBC_New/src/common/Collision/Management/MMapManager.cpp:20:
  57. /home/grad/TBC_New/src/common/Asio/AsioHacksFwd.h:55:15: error: redefinition of default argument for ‘class TimeTraits’
  58.    55 |         class basic_deadline_timer;
  59.       |               ^~~~~~~~~~~~~~~~~~~~
  60. In file included from /home/grad/TBC_New/src/common/Asio/AsioHacksFwd.h:23,
  61.                  from /home/grad/TBC_New/src/common/Logging/Log.h:23,
  62.                  from /home/grad/TBC_New/src/common/Collision/Management/MMapManager.cpp:20:
  63. /usr/include/boost/asio/basic_deadline_timer.hpp:128:5: note: original definition appeared here
  64.   128 |     typename TimeTraits = boost::asio::time_traits<Time>,
  65.       |     ^~~~~~~~
  66. In file included from /home/grad/TBC_New/src/common/Logging/Log.h:23,
  67.                  from /home/grad/TBC_New/src/common/Collision/Management/MMapManager.cpp:20:
  68. /home/grad/TBC_New/src/common/Asio/AsioHacksFwd.h:56:17: error: ‘TimeTraits’ does not name a type; did you mean ‘time_traits’?
  69.    56 |         typedef TimeTraits traits_type;
  70.       |                 ^~~~~~~~~~
  71.       |                 time_traits
  72. [ 11%] Building CXX object src/common/CMakeFiles/common.dir/Collision/Models/WorldModel.cpp.o
  73. [ 11%] Building CXX object src/common/CMakeFiles/common.dir/Collision/PrecompiledHeaders/collisionPCH.cpp.o
  74. In file included from /home/grad/TBC_New/src/common/Logging/Log.h:23,
  75.                  from /home/grad/TBC_New/src/common/Collision/Models/GameObjectModel.cpp:26:
  76. /home/grad/TBC_New/src/common/Asio/AsioHacksFwd.h:55:15: error: redefinition of default argument for ‘class TimeTraits’
  77.    55 |         class basic_deadline_timer;
  78.       |               ^~~~~~~~~~~~~~~~~~~~
  79. In file included from /home/grad/TBC_New/src/common/Asio/AsioHacksFwd.h:23,
  80.                  from /home/grad/TBC_New/src/common/Logging/Log.h:23,
  81.                  from /home/grad/TBC_New/src/common/Collision/Models/GameObjectModel.cpp:26:
  82. /usr/include/boost/asio/basic_deadline_timer.hpp:128:5: note: original definition appeared here
  83.   128 |     typename TimeTraits = boost::asio::time_traits<Time>,
  84.       |     ^~~~~~~~
  85. In file included from /home/grad/TBC_New/src/common/Logging/Log.h:23,
  86.                  from /home/grad/TBC_New/src/common/Collision/Models/GameObjectModel.cpp:26:
  87. /home/grad/TBC_New/src/common/Asio/AsioHacksFwd.h:56:17: error: ‘TimeTraits’ does not name a type; did you mean ‘time_traits’?
  88.    56 |         typedef TimeTraits traits_type;
  89.       |                 ^~~~~~~~~~
  90.       |                 time_traits
  91. [ 12%] Building CXX object src/common/CMakeFiles/common.dir/Configuration/BuiltInConfig.cpp.o
  92. make[2]: *** [src/common/CMakeFiles/common.dir/build.make:153: src/common/CMakeFiles/common.dir/Collision/DynamicTree.cpp.o] Ошибка 1
  93. make[2]: *** Ожидание завершения заданий…
  94. make[2]: *** [src/common/CMakeFiles/common.dir/build.make:209: src/common/CMakeFiles/common.dir/Collision/Management/VMapManager2.cpp.o] Ошибка 1
  95. make[2]: *** [src/common/CMakeFiles/common.dir/build.make:223: src/common/CMakeFiles/common.dir/Collision/Maps/MapTree.cpp.o] Ошибка 1
  96. make[2]: *** [src/common/CMakeFiles/common.dir/build.make:251: src/common/CMakeFiles/common.dir/Collision/Models/GameObjectModel.cpp.o] Ошибка 1
  97. make[2]: *** [src/common/CMakeFiles/common.dir/build.make:181: src/common/CMakeFiles/common.dir/Collision/Management/MMapManager.cpp.o] Ошибка 1
  98. make[1]: *** [CMakeFiles/Makefile2:934: src/common/CMakeFiles/common.dir/all] Ошибка 2
  99. make: *** [Makefile:149: all] Ошибка 2
  100.  

A PHP Error was encountered

Severity: Core Warning

Message: PHP Startup: Unable to load dynamic library 'mcrypt.so' (tried: /usr/lib/php/20170718/mcrypt.so (/usr/lib/php/20170718/mcrypt.so: cannot open shared object file: No such file or directory), /usr/lib/php/20170718/mcrypt.so.so (/usr/lib/php/20170718/mcrypt.so.so: cannot open shared object file: No such file or directory))

Filename: Unknown

Line Number: 0

Backtrace: