From grad, 11 Months ago, written in Plain Text.
Embed
  1. [ 10%] Building CXX object src/common/CMakeFiles/common.dir/Collision/BoundingIntervalHierarchy.cpp.o
  2. [ 11%] Building CXX object src/common/CMakeFiles/common.dir/Collision/Management/VMapFactory.cpp.o
  3. [ 11%] Building CXX object src/common/CMakeFiles/common.dir/Collision/Maps/TileAssembler.cpp.o
  4. [ 11%] Building CXX object src/common/CMakeFiles/common.dir/Collision/Models/GameObjectModel.cpp.o
  5. In file included from /home/grad/TBC_New/src/common/Logging/Log.h:23,
  6.                  from /home/grad/TBC_New/src/common/Collision/DynamicTree.cpp:24:
  7. /home/grad/TBC_New/src/common/Asio/AsioHacksFwd.h:55:3: error: template declaration of ‘typedef’
  8.    55 |   typedef TimeTraits traits_type;
  9.       |   ^~~~~~~
  10. /home/grad/TBC_New/src/common/Asio/AsioHacksFwd.h:56:15: error: template argument required for ‘class basic_deadline_timer’
  11.    56 |         class basic_deadline_timer;
  12.       |               ^~~~~~~~~~~~~~~~~~~~
  13. [ 11%] Building CXX object src/common/CMakeFiles/common.dir/Collision/Models/ModelInstance.cpp.o
  14. In file included from /home/grad/TBC_New/src/common/Logging/Log.h:23,
  15.                  from /home/grad/TBC_New/src/common/Collision/Maps/MapTree.cpp:23:
  16. /home/grad/TBC_New/src/common/Asio/AsioHacksFwd.h:55:3: error: template declaration of ‘typedef’
  17.    55 |   typedef TimeTraits traits_type;
  18.       |   ^~~~~~~
  19. /home/grad/TBC_New/src/common/Asio/AsioHacksFwd.h:56:15: error: template argument required for ‘class basic_deadline_timer’
  20.    56 |         class basic_deadline_timer;
  21.       |               ^~~~~~~~~~~~~~~~~~~~
  22. In file included from /home/grad/TBC_New/src/common/Logging/Log.h:23,
  23.                  from /home/grad/TBC_New/src/common/Collision/Management/MMapManager.cpp:20:
  24. /home/grad/TBC_New/src/common/Asio/AsioHacksFwd.h:55:3: error: template declaration of ‘typedef’
  25.    55 |   typedef TimeTraits traits_type;
  26.       |   ^~~~~~~
  27. /home/grad/TBC_New/src/common/Asio/AsioHacksFwd.h:56:15: error: template argument required for ‘class basic_deadline_timer’
  28.    56 |         class basic_deadline_timer;
  29.       |               ^~~~~~~~~~~~~~~~~~~~
  30. In file included from /home/grad/TBC_New/src/common/Logging/Log.h:23,
  31.                  from /home/grad/TBC_New/src/common/Collision/Management/VMapManager2.cpp:28:
  32. /home/grad/TBC_New/src/common/Asio/AsioHacksFwd.h:55:3: error: template declaration of ‘typedef’
  33.    55 |   typedef TimeTraits traits_type;
  34.       |   ^~~~~~~
  35. /home/grad/TBC_New/src/common/Asio/AsioHacksFwd.h:56:15: error: template argument required for ‘class basic_deadline_timer’
  36.    56 |         class basic_deadline_timer;
  37.       |               ^~~~~~~~~~~~~~~~~~~~
  38. [ 11%] Building CXX object src/common/CMakeFiles/common.dir/Collision/Models/WorldModel.cpp.o
  39. In file included from /home/grad/TBC_New/src/common/Logging/Log.h:23,
  40.                  from /home/grad/TBC_New/src/common/Collision/Models/GameObjectModel.cpp:26:
  41. /home/grad/TBC_New/src/common/Asio/AsioHacksFwd.h:55:3: error: template declaration of ‘typedef’
  42.    55 |   typedef TimeTraits traits_type;
  43.       |   ^~~~~~~
  44. /home/grad/TBC_New/src/common/Asio/AsioHacksFwd.h:56:15: error: template argument required for ‘class basic_deadline_timer’
  45.    56 |         class basic_deadline_timer;
  46.       |               ^~~~~~~~~~~~~~~~~~~~
  47. [ 11%] Building CXX object src/common/CMakeFiles/common.dir/Collision/PrecompiledHeaders/collisionPCH.cpp.o
  48. [ 12%] Building CXX object src/common/CMakeFiles/common.dir/Configuration/BuiltInConfig.cpp.o
  49. make[2]: *** [src/common/CMakeFiles/common.dir/build.make:153: src/common/CMakeFiles/common.dir/Collision/DynamicTree.cpp.o] Ошибка 1
  50. make[2]: *** Ожидание завершения заданий…
  51. make[2]: *** [src/common/CMakeFiles/common.dir/build.make:223: src/common/CMakeFiles/common.dir/Collision/Maps/MapTree.cpp.o] Ошибка 1
  52. make[2]: *** [src/common/CMakeFiles/common.dir/build.make:209: src/common/CMakeFiles/common.dir/Collision/Management/VMapManager2.cpp.o] Ошибка 1
  53. make[2]: *** [src/common/CMakeFiles/common.dir/build.make:251: src/common/CMakeFiles/common.dir/Collision/Models/GameObjectModel.cpp.o] Ошибка 1
  54. make[2]: *** [src/common/CMakeFiles/common.dir/build.make:181: src/common/CMakeFiles/common.dir/Collision/Management/MMapManager.cpp.o] Ошибка 1
  55. make[1]: *** [CMakeFiles/Makefile2:934: src/common/CMakeFiles/common.dir/all] Ошибка 2
  56. make: *** [Makefile:149: all] Ошибка 2
  57.  

A PHP Error was encountered

Severity: Core Warning

Message: PHP Startup: Unable to load dynamic library 'mcrypt.so' (tried: /usr/lib/php/20170718/mcrypt.so (/usr/lib/php/20170718/mcrypt.so: cannot open shared object file: No such file or directory), /usr/lib/php/20170718/mcrypt.so.so (/usr/lib/php/20170718/mcrypt.so.so: cannot open shared object file: No such file or directory))

Filename: Unknown

Line Number: 0

Backtrace: