From grad, 11 Months ago, written in Plain Text.
Embed
  1. [ 11%] Building CXX object src/common/CMakeFiles/common.dir/Collision/Models/GameObjectModel.cpp.o
  2. [ 11%] Building CXX object src/common/CMakeFiles/common.dir/Collision/Models/ModelInstance.cpp.o
  3. In file included from /home/grad/TBC_New/src/common/Logging/Log.h:23,
  4.                  from /home/grad/TBC_New/src/common/Collision/DynamicTree.cpp:24:
  5. /home/grad/TBC_New/src/common/Asio/AsioHacksFwd.h:55:15: error: redefinition of default argument for ‘class time_traits’
  6.    55 |         class basic_deadline_timer;
  7.       |               ^~~~~~~~~~~~~~~~~~~~
  8. In file included from /home/grad/TBC_New/src/common/Asio/AsioHacksFwd.h:23,
  9.                  from /home/grad/TBC_New/src/common/Logging/Log.h:23,
  10.                  from /home/grad/TBC_New/src/common/Collision/DynamicTree.cpp:24:
  11. /usr/include/boost/asio/basic_deadline_timer.hpp:128:5: note: original definition appeared here
  12.   128 |     typename TimeTraits = boost::asio::time_traits<Time>,
  13.       |     ^~~~~~~~
  14. In file included from /home/grad/TBC_New/src/common/Logging/Log.h:23,
  15.                  from /home/grad/TBC_New/src/common/Collision/DynamicTree.cpp:24:
  16. /home/grad/TBC_New/src/common/Asio/AsioHacksFwd.h:56:17: error: ‘TimeTraits’ does not name a type; did you mean ‘time_traits’?
  17.    56 |         typedef TimeTraits traits_type;
  18.       |                 ^~~~~~~~~~
  19.       |                 time_traits
  20. In file included from /home/grad/TBC_New/src/common/Logging/Log.h:23,
  21.                  from /home/grad/TBC_New/src/common/Collision/Maps/MapTree.cpp:23:
  22. /home/grad/TBC_New/src/common/Asio/AsioHacksFwd.h:55:15: error: redefinition of default argument for ‘class time_traits’
  23.    55 |         class basic_deadline_timer;
  24.       |               ^~~~~~~~~~~~~~~~~~~~
  25. In file included from /home/grad/TBC_New/src/common/Asio/AsioHacksFwd.h:23,
  26.                  from /home/grad/TBC_New/src/common/Logging/Log.h:23,
  27.                  from /home/grad/TBC_New/src/common/Collision/Maps/MapTree.cpp:23:
  28. /usr/include/boost/asio/basic_deadline_timer.hpp:128:5: note: original definition appeared here
  29.   128 |     typename TimeTraits = boost::asio::time_traits<Time>,
  30.       |     ^~~~~~~~
  31. In file included from /home/grad/TBC_New/src/common/Logging/Log.h:23,
  32.                  from /home/grad/TBC_New/src/common/Collision/Maps/MapTree.cpp:23:
  33. /home/grad/TBC_New/src/common/Asio/AsioHacksFwd.h:56:17: error: ‘TimeTraits’ does not name a type; did you mean ‘time_traits’?
  34.    56 |         typedef TimeTraits traits_type;
  35.       |                 ^~~~~~~~~~
  36.       |                 time_traits
  37. In file included from /home/grad/TBC_New/src/common/Logging/Log.h:23,
  38.                  from /home/grad/TBC_New/src/common/Collision/Management/VMapManager2.cpp:28:
  39. /home/grad/TBC_New/src/common/Asio/AsioHacksFwd.h:55:15: error: redefinition of default argument for ‘class time_traits’
  40.    55 |         class basic_deadline_timer;
  41.       |               ^~~~~~~~~~~~~~~~~~~~
  42. In file included from /home/grad/TBC_New/src/common/Asio/AsioHacksFwd.h:23,
  43.                  from /home/grad/TBC_New/src/common/Logging/Log.h:23,
  44.                  from /home/grad/TBC_New/src/common/Collision/Management/VMapManager2.cpp:28:
  45. /usr/include/boost/asio/basic_deadline_timer.hpp:128:5: note: original definition appeared here
  46.   128 |     typename TimeTraits = boost::asio::time_traits<Time>,
  47.       |     ^~~~~~~~
  48. In file included from /home/grad/TBC_New/src/common/Logging/Log.h:23,
  49.                  from /home/grad/TBC_New/src/common/Collision/Management/VMapManager2.cpp:28:
  50. /home/grad/TBC_New/src/common/Asio/AsioHacksFwd.h:56:17: error: ‘TimeTraits’ does not name a type; did you mean ‘time_traits’?
  51.    56 |         typedef TimeTraits traits_type;
  52.       |                 ^~~~~~~~~~
  53.       |                 time_traits
  54. [ 11%] Building CXX object src/common/CMakeFiles/common.dir/Collision/Models/WorldModel.cpp.o
  55. In file included from /home/grad/TBC_New/src/common/Logging/Log.h:23,
  56.                  from /home/grad/TBC_New/src/common/Collision/Management/MMapManager.cpp:20:
  57. /home/grad/TBC_New/src/common/Asio/AsioHacksFwd.h:55:15: error: redefinition of default argument for ‘class time_traits’
  58.    55 |         class basic_deadline_timer;
  59.       |               ^~~~~~~~~~~~~~~~~~~~
  60. In file included from /home/grad/TBC_New/src/common/Asio/AsioHacksFwd.h:23,
  61.                  from /home/grad/TBC_New/src/common/Logging/Log.h:23,
  62.                  from /home/grad/TBC_New/src/common/Collision/Management/MMapManager.cpp:20:
  63. /usr/include/boost/asio/basic_deadline_timer.hpp:128:5: note: original definition appeared here
  64.   128 |     typename TimeTraits = boost::asio::time_traits<Time>,
  65.       |     ^~~~~~~~
  66. In file included from /home/grad/TBC_New/src/common/Logging/Log.h:23,
  67.                  from /home/grad/TBC_New/src/common/Collision/Management/MMapManager.cpp:20:
  68. /home/grad/TBC_New/src/common/Asio/AsioHacksFwd.h:56:17: error: ‘TimeTraits’ does not name a type; did you mean ‘time_traits’?
  69.    56 |         typedef TimeTraits traits_type;
  70.       |                 ^~~~~~~~~~
  71.       |                 time_traits
  72. In file included from /home/grad/TBC_New/src/common/Logging/Log.h:23,
  73.                  from /home/grad/TBC_New/src/common/Collision/Models/GameObjectModel.cpp:26:
  74. /home/grad/TBC_New/src/common/Asio/AsioHacksFwd.h:55:15: error: redefinition of default argument for ‘class time_traits’
  75.    55 |         class basic_deadline_timer;
  76.       |               ^~~~~~~~~~~~~~~~~~~~
  77. In file included from /home/grad/TBC_New/src/common/Asio/AsioHacksFwd.h:23,
  78.                  from /home/grad/TBC_New/src/common/Logging/Log.h:23,
  79.                  from /home/grad/TBC_New/src/common/Collision/Models/GameObjectModel.cpp:26:
  80. /usr/include/boost/asio/basic_deadline_timer.hpp:128:5: note: original definition appeared here
  81.   128 |     typename TimeTraits = boost::asio::time_traits<Time>,
  82.       |     ^~~~~~~~
  83. In file included from /home/grad/TBC_New/src/common/Logging/Log.h:23,
  84.                  from /home/grad/TBC_New/src/common/Collision/Models/GameObjectModel.cpp:26:
  85. /home/grad/TBC_New/src/common/Asio/AsioHacksFwd.h:56:17: error: ‘TimeTraits’ does not name a type; did you mean ‘time_traits’?
  86.    56 |         typedef TimeTraits traits_type;
  87.       |                 ^~~~~~~~~~
  88.       |                 time_traits
  89. [ 11%] Building CXX object src/common/CMakeFiles/common.dir/Collision/PrecompiledHeaders/collisionPCH.cpp.o
  90. [ 12%] Building CXX object src/common/CMakeFiles/common.dir/Configuration/BuiltInConfig.cpp.o
  91. make[2]: *** [src/common/CMakeFiles/common.dir/build.make:153: src/common/CMakeFiles/common.dir/Collision/DynamicTree.cpp.o] Ошибка 1
  92. make[2]: *** Ожидание завершения заданий…
  93. make[2]: *** [src/common/CMakeFiles/common.dir/build.make:209: src/common/CMakeFiles/common.dir/Collision/Management/VMapManager2.cpp.o] Ошибка 1
  94. make[2]: *** [src/common/CMakeFiles/common.dir/build.make:223: src/common/CMakeFiles/common.dir/Collision/Maps/MapTree.cpp.o] Ошибка 1
  95. make[2]: *** [src/common/CMakeFiles/common.dir/build.make:251: src/common/CMakeFiles/common.dir/Collision/Models/GameObjectModel.cpp.o] Ошибка 1
  96. make[2]: *** [src/common/CMakeFiles/common.dir/build.make:181: src/common/CMakeFiles/common.dir/Collision/Management/MMapManager.cpp.o] Ошибка 1
  97. make[1]: *** [CMakeFiles/Makefile2:934: src/common/CMakeFiles/common.dir/all] Ошибка 2
  98. make: *** [Makefile:149: all] Ошибка 2
  99.  
  100.  

A PHP Error was encountered

Severity: Core Warning

Message: PHP Startup: Unable to load dynamic library 'mcrypt.so' (tried: /usr/lib/php/20170718/mcrypt.so (/usr/lib/php/20170718/mcrypt.so: cannot open shared object file: No such file or directory), /usr/lib/php/20170718/mcrypt.so.so (/usr/lib/php/20170718/mcrypt.so.so: cannot open shared object file: No such file or directory))

Filename: Unknown

Line Number: 0

Backtrace: