From grad, 10 Months ago, written in Plain Text.
Embed
  1. [ 21%] Building CXX object src/server/game/CMakeFiles/game.dir/Grids/GridStates.cpp.o
  2. [ 21%] Building CXX object src/server/game/CMakeFiles/game.dir/Grids/NGrid.cpp.o
  3. cc1plus: warning: /home/grad/TBC_New/build/src/server/game/cotire/game_CXX_prefix.hxx.gch: not used because `BOOST_ALL_NO_LIB' is defined [-Winvalid-pch]
  4. cc1plus: warning: /home/grad/TBC_New/build/src/server/game/cotire/game_CXX_prefix.hxx.gch: not used because `BOOST_ALL_NO_LIB' is defined [-Winvalid-pch]
  5. cc1plus: warning: /home/grad/TBC_New/build/src/server/game/cotire/game_CXX_prefix.hxx.gch: not used because `BOOST_ALL_NO_LIB' is defined [-Winvalid-pch]
  6. cc1plus: warning: /home/grad/TBC_New/build/src/server/game/cotire/game_CXX_prefix.hxx.gch: not used because `BOOST_ALL_NO_LIB' is defined [-Winvalid-pch]
  7. cc1plus: warning: /home/grad/TBC_New/build/src/server/game/cotire/game_CXX_prefix.hxx.gch: not used because `BOOST_ALL_NO_LIB' is defined [-Winvalid-pch]
  8. cc1plus: warning: /home/grad/TBC_New/build/src/server/game/cotire/game_CXX_prefix.hxx.gch: not used because `BOOST_ALL_NO_LIB' is defined [-Winvalid-pch]
  9. cc1plus: warning: /home/grad/TBC_New/build/src/server/game/cotire/game_CXX_prefix.hxx.gch: not used because `BOOST_ALL_NO_LIB' is defined [-Winvalid-pch]
  10. cc1plus: warning: /home/grad/TBC_New/build/src/server/game/cotire/game_CXX_prefix.hxx.gch: not used because `BOOST_ALL_NO_LIB' is defined [-Winvalid-pch]
  11. cc1plus: warning: /home/grad/TBC_New/build/src/server/game/cotire/game_CXX_prefix.hxx.gch: not used because `BOOST_ALL_NO_LIB' is defined [-Winvalid-pch]
  12. Scanning dependencies of target scripts
  13. [ 21%] Building CXX object src/server/scripts/CMakeFiles/scripts.dir/EasternKingdoms/MagistersTerrace/boss_felblood_kaelthas.cpp.o
  14. cc1plus: warning: /home/grad/TBC_New/build/src/server/scripts/cotire/scripts_CXX_prefix.hxx.gch: not used because `BOOST_ALL_NO_LIB' is defined [-Winvalid-pch]
  15. /home/grad/TBC_New/src/server/scripts/EasternKingdoms/MagistersTerrace/boss_felblood_kaelthas.cpp: In member function ‘virtual void boss_felblood_kaelthas::boss_felblood_kaelthasAI::UpdateAI(uint32)’:
  16. /home/grad/TBC_New/src/server/scripts/EasternKingdoms/MagistersTerrace/boss_felblood_kaelthas.cpp:224:25: error: ‘class Creature’ has no member named ‘CastCustomSpell’
  17.   224 |                     me->CastCustomSpell(SPELL_PYROBLAST, SPELLVALUE_MAX_TARGETS, 1, (Unit*)NULL, false);
  18.       |                         ^~~~~~~~~~~~~~~
  19. make[2]: *** [src/server/scripts/CMakeFiles/scripts.dir/build.make:2015: src/server/scripts/CMakeFiles/scripts.dir/EasternKingdoms/MagistersTerrace/boss_felblood_kaelthas.cpp.o] Ошибка 1
  20. make[1]: *** [CMakeFiles/Makefile2:1167: src/server/scripts/CMakeFiles/scripts.dir/all] Ошибка 2
  21. make[1]: *** Ожидание завершения заданий…
  22.  

A PHP Error was encountered

Severity: Core Warning

Message: PHP Startup: Unable to load dynamic library 'mcrypt.so' (tried: /usr/lib/php/20170718/mcrypt.so (/usr/lib/php/20170718/mcrypt.so: cannot open shared object file: No such file or directory), /usr/lib/php/20170718/mcrypt.so.so (/usr/lib/php/20170718/mcrypt.so.so: cannot open shared object file: No such file or directory))

Filename: Unknown

Line Number: 0

Backtrace: