From grad, 10 Months ago, written in Plain Text.
Embed
  1. [ 18%] Building CXX object src/server/database/CMakeFiles/database.dir/Database/Implementation/LoginDatabase.cpp.o
  2. [ 18%] Building CXX object src/server/database/CMakeFiles/database.dir/Database/Implementation/LogsDatabase.cpp.o
  3. [ 18%] Building CXX object src/server/database/CMakeFiles/database.dir/Database/Implementation/WorldDatabase.cpp.o
  4. [ 18%] Building CXX object src/server/database/CMakeFiles/database.dir/Logging/AppenderDB.cpp.o
  5. [ 18%] Building CXX object src/server/database/CMakeFiles/database.dir/Updater/DBUpdater.cpp.o
  6. [ 19%] Building CXX object src/server/database/CMakeFiles/database.dir/Updater/UpdateFetcher.cpp.o
  7. [ 19%] Linking CXX static library libdatabase.a
  8. [ 19%] Built target database
  9. [ 19%] Generating CXX prefix source src/server/shared/cotire/shared_CXX_prefix.cxx
  10. [ 19%] Generating CXX prefix header src/server/shared/cotire/shared_CXX_prefix.hxx
  11. [ 19%] Building CXX precompiled header src/server/shared/cotire/shared_CXX_prefix.hxx.gch
  12. Scanning dependencies of target shared
  13. [ 19%] Building CXX object src/server/shared/CMakeFiles/shared.dir/Packets/ByteBuffer.cpp.o
  14. [ 20%] Building CXX object src/server/shared/CMakeFiles/shared.dir/DataStores/DBCDatabaseLoader.cpp.o
  15. [ 20%] Building CXX object src/server/shared/CMakeFiles/shared.dir/DataStores/DBCStore.cpp.o
  16. [ 20%] Building CXX object src/server/shared/CMakeFiles/shared.dir/Realm/Realm.cpp.o
  17. [ 20%] Building CXX object src/server/shared/CMakeFiles/shared.dir/Realm/RealmList.cpp.o
  18. [ 20%] Linking CXX static library libshared.a
  19. [ 20%] Built target shared
  20. [ 20%] Generating CXX prefix source src/server/authserver/cotire/authserver_CXX_prefix.cxx
  21. [ 20%] Generating CXX prefix source src/server/game/cotire/game_CXX_prefix.cxx
  22. [ 21%] Generating CXX prefix source src/server/scripts/cotire/scripts_CXX_prefix.cxx
  23. [ 21%] Generating CXX prefix header src/server/game/cotire/game_CXX_prefix.hxx
  24. [ 21%] Generating CXX prefix header src/server/authserver/cotire/authserver_CXX_prefix.hxx
  25. [ 21%] Generating CXX prefix header src/server/scripts/cotire/scripts_CXX_prefix.hxx
  26. [ 22%] Building CXX precompiled header src/server/game/cotire/game_CXX_prefix.hxx.gch
  27. [ 23%] Building CXX precompiled header src/server/authserver/cotire/authserver_CXX_prefix.hxx.gch
  28. [ 23%] Building CXX precompiled header src/server/scripts/cotire/scripts_CXX_prefix.hxx.gch
  29. In file included from /home/grad/tbc/src/server/game/Entities/Item/Item.h:5,
  30.                  from /home/grad/tbc/src/server/game/DataStores/DBCStores.h:7,
  31.                  from /home/grad/tbc/src/server/game/PrecompiledHeaders/gamePCH.h:10,
  32.                  from /home/grad/tbc/build/src/server/game/cotire/game_CXX_prefix.cxx:4,
  33.                  from /home/grad/tbc/build/src/server/game/cotire/game_CXX_prefix.hxx:4:
  34. /home/grad/tbc/src/server/game/Entities/Object/Object.h: In member function ‘void WorldObject::VisitNearbyGridObject(const float&, NOTIFIER&) const’:
  35. /home/grad/tbc/src/server/game/Entities/Object/Object.h:649:136: error: ‘x’ was not declared in this scope
  36.   649 |         template<class NOTIFIER> void VisitNearbyGridObject(float const& radius, NOTIFIER& notifier) const { if (IsInWorld()) getNGrid(x, y)->VisitGrid(GetPositionX(), GetPositionY(), radius, notifier); }
  37.       |                                                                                                                                        ^
  38. /home/grad/tbc/src/server/game/Entities/Object/Object.h:649:139: error: ‘y’ was not declared in this scope; did you mean ‘yn’?
  39.   649 |         template<class NOTIFIER> void VisitNearbyGridObject(float const& radius, NOTIFIER& notifier) const { if (IsInWorld()) getNGrid(x, y)->VisitGrid(GetPositionX(), GetPositionY(), radius, notifier); }
  40.       |                                                                                                                                           ^
  41.       |                                                                                                                                           yn
  42. /home/grad/tbc/src/server/game/Entities/Object/Object.h:649:127: error: there are no arguments to ‘getNGrid’ that depend on a template parameter, so a declaration of ‘getNGrid’ must be available [-fpermissive]
  43.   649 |         template<class NOTIFIER> void VisitNearbyGridObject(float const& radius, NOTIFIER& notifier) const { if (IsInWorld()) getNGrid(x, y)->VisitGrid(GetPositionX(), GetPositionY(), radius, notifier); }
  44.       |                                                                                                                               ^~~~~~~~
  45. /home/grad/tbc/src/server/game/Entities/Object/Object.h:649:127: note: (if you use ‘-fpermissive’, G++ will accept your code, but allowing the use of an undeclared name is deprecated)
  46. /home/grad/tbc/src/server/game/Entities/Object/Object.h: In member function ‘void WorldObject::VisitNearbyWorldObject(const float&, NOTIFIER&) const’:
  47. /home/grad/tbc/src/server/game/Entities/Object/Object.h:650:138: error: ‘class Map’ has no member named ‘VisitWorld’; did you mean ‘VisitAll’?
  48.   650 |         template<class NOTIFIER> void VisitNearbyWorldObject(float const& radius, NOTIFIER& notifier) const { if (IsInWorld()) GetMap()->VisitWorld(GetPositionX(), GetPositionY(), radius, notifier); }
  49.       |                                                                                                                                          ^~~~~~~~~~
  50.       |                                                                                                                                          VisitAll
  51. In file included from /home/grad/tbc/src/server/game/Entities/Unit/Unit.h:5,
  52.                  from /home/grad/tbc/src/server/game/Entities/Creature/Creature.h:6,
  53.                  from /home/grad/tbc/src/server/game/Globals/ObjectMgr.h:5,
  54.                  from /home/grad/tbc/src/server/game/Scripting/ScriptMgr.h:12,
  55.                  from /home/grad/tbc/src/server/scripts/ScriptPCH.h:9,
  56.                  from /home/grad/tbc/build/src/server/scripts/cotire/scripts_CXX_prefix.cxx:4,
  57.                  from /home/grad/tbc/build/src/server/scripts/cotire/scripts_CXX_prefix.hxx:4:
  58. /home/grad/tbc/src/server/game/Entities/Object/Object.h: In member function ‘void WorldObject::VisitNearbyGridObject(const float&, NOTIFIER&) const’:
  59. /home/grad/tbc/src/server/game/Entities/Object/Object.h:649:136: error: ‘x’ was not declared in this scope
  60.   649 |         template<class NOTIFIER> void VisitNearbyGridObject(float const& radius, NOTIFIER& notifier) const { if (IsInWorld()) getNGrid(x, y)->VisitGrid(GetPositionX(), GetPositionY(), radius, notifier); }
  61.       |                                                                                                                                        ^
  62. /home/grad/tbc/src/server/game/Entities/Object/Object.h:649:139: error: ‘y’ was not declared in this scope; did you mean ‘yn’?
  63.   649 |         template<class NOTIFIER> void VisitNearbyGridObject(float const& radius, NOTIFIER& notifier) const { if (IsInWorld()) getNGrid(x, y)->VisitGrid(GetPositionX(), GetPositionY(), radius, notifier); }
  64.       |                                                                                                                                           ^
  65.       |                                                                                                                                           yn
  66. /home/grad/tbc/src/server/game/Entities/Object/Object.h:649:127: error: there are no arguments to ‘getNGrid’ that depend on a template parameter, so a declaration of ‘getNGrid’ must be available [-fpermissive]
  67.   649 |         template<class NOTIFIER> void VisitNearbyGridObject(float const& radius, NOTIFIER& notifier) const { if (IsInWorld()) getNGrid(x, y)->VisitGrid(GetPositionX(), GetPositionY(), radius, notifier); }
  68.       |                                                                                                                               ^~~~~~~~
  69. /home/grad/tbc/src/server/game/Entities/Object/Object.h:649:127: note: (if you use ‘-fpermissive’, G++ will accept your code, but allowing the use of an undeclared name is deprecated)
  70. /home/grad/tbc/src/server/game/Entities/Object/Object.h: In member function ‘void WorldObject::VisitNearbyWorldObject(const float&, NOTIFIER&) const’:
  71. /home/grad/tbc/src/server/game/Entities/Object/Object.h:650:138: error: ‘class Map’ has no member named ‘VisitWorld’; did you mean ‘VisitAll’?
  72.   650 |         template<class NOTIFIER> void VisitNearbyWorldObject(float const& radius, NOTIFIER& notifier) const { if (IsInWorld()) GetMap()->VisitWorld(GetPositionX(), GetPositionY(), radius, notifier); }
  73.       |                                                                                                                                          ^~~~~~~~~~
  74.       |                                                                                                                                          VisitAll
  75. Scanning dependencies of target authserver
  76. [ 23%] Building CXX object src/server/authserver/CMakeFiles/authserver.dir/Main.cpp.o
  77. [ 23%] Building CXX object src/server/authserver/CMakeFiles/authserver.dir/Authentication/AuthCodes.cpp.o
  78. [ 23%] Building CXX object src/server/authserver/CMakeFiles/authserver.dir/Authentication/TOTP.cpp.o
  79. [ 24%] Building CXX object src/server/authserver/CMakeFiles/authserver.dir/Server/AuthSession.cpp.o
  80. cc1plus: warning: /home/grad/tbc/build/src/server/authserver/cotire/authserver_CXX_prefix.hxx.gch: not used because `BOOST_ALL_NO_LIB' is defined [-Winvalid-pch]
  81. cc1plus: warning: /home/grad/tbc/build/src/server/authserver/cotire/authserver_CXX_prefix.hxx.gch: not used because `BOOST_ALL_NO_LIB' is defined [-Winvalid-pch]
  82. cc1plus: warning: /home/grad/tbc/build/src/server/authserver/cotire/authserver_CXX_prefix.hxx.gch: not used because `BOOST_ALL_NO_LIB' is defined [-Winvalid-pch]
  83. cc1plus: warning: /home/grad/tbc/build/src/server/authserver/cotire/authserver_CXX_prefix.hxx.gch: not used because `BOOST_ALL_NO_LIB' is defined [-Winvalid-pch]
  84. [ 24%] Linking CXX executable authserver
  85. CMake Error at /home/grad/tbc/dep/cotire/CMake/cotire.cmake:1990 (message):
  86.   cotire: error 1 precompiling
  87.   /home/grad/tbc/build/src/server/game/cotire/game_CXX_prefix.hxx.
  88. Call Stack (most recent call first):
  89.   /home/grad/tbc/dep/cotire/CMake/cotire.cmake:3694 (cotire_precompile_prefix_header)
  90.  
  91.  
  92. make[2]: *** [src/server/game/CMakeFiles/game.dir/build.make:83: src/server/game/cotire/game_CXX_prefix.hxx.gch] Ошибка 1
  93. make[1]: *** [CMakeFiles/Makefile2:1107: src/server/game/CMakeFiles/game.dir/all] Ошибка 2
  94. make[1]: *** Ожидание завершения заданий…
  95. CMake Error at /home/grad/tbc/dep/cotire/CMake/cotire.cmake:1990 (message):
  96.   cotire: error 1 precompiling
  97.   /home/grad/tbc/build/src/server/scripts/cotire/scripts_CXX_prefix.hxx.
  98. Call Stack (most recent call first):
  99.   /home/grad/tbc/dep/cotire/CMake/cotire.cmake:3694 (cotire_precompile_prefix_header)
  100.  
  101.  
  102. make[2]: *** [src/server/scripts/CMakeFiles/scripts.dir/build.make:83: src/server/scripts/cotire/scripts_CXX_prefix.hxx.gch] Ошибка 1
  103. make[1]: *** [CMakeFiles/Makefile2:1166: src/server/scripts/CMakeFiles/scripts.dir/all] Ошибка 2
  104. [ 24%] Built target authserver
  105. make: *** [Makefile:149: all] Ошибка 2
  106.  

A PHP Error was encountered

Severity: Core Warning

Message: PHP Startup: Unable to load dynamic library 'mcrypt.so' (tried: /usr/lib/php/20170718/mcrypt.so (/usr/lib/php/20170718/mcrypt.so: cannot open shared object file: No such file or directory), /usr/lib/php/20170718/mcrypt.so.so (/usr/lib/php/20170718/mcrypt.so.so: cannot open shared object file: No such file or directory))

Filename: Unknown

Line Number: 0

Backtrace: