From grad, 2 Months ago, written in Plain Text.
Embed
  1. [ 11%] Building CXX object src/common/CMakeFiles/common.dir/Collision/Models/GameObjectModel.cpp.o
  2. [ 11%] Building CXX object src/common/CMakeFiles/common.dir/Collision/Models/ModelInstance.cpp.o
  3. In file included from /home/grad/TBC_New/src/common/Logging/Log.h:23,
  4.                  from /home/grad/TBC_New/src/common/Collision/Maps/MapTree.cpp:23:
  5. /home/grad/TBC_New/src/common/Asio/AsioHacksFwd.h:51:15: error: redefinition of default argument for ‘class TimeTraits’
  6.    51 |         class basic_deadline_timer
  7.       |               ^~~~~~~~~~~~~~~~~~~~
  8. In file included from /home/grad/TBC_New/src/common/Asio/AsioHacksFwd.h:31,
  9.                  from /home/grad/TBC_New/src/common/Logging/Log.h:23,
  10.                  from /home/grad/TBC_New/src/common/Collision/Maps/MapTree.cpp:23:
  11. /usr/include/boost/asio/basic_deadline_timer.hpp:128:5: note: original definition appeared here
  12.   128 |     typename TimeTraits = boost::asio::time_traits<Time>,
  13.       |     ^~~~~~~~
  14. In file included from /home/grad/TBC_New/src/common/Logging/Log.h:23,
  15.                  from /home/grad/TBC_New/src/common/Collision/DynamicTree.cpp:24:
  16. /home/grad/TBC_New/src/common/Asio/AsioHacksFwd.h:51:15: error: redefinition of default argument for ‘class TimeTraits’
  17.    51 |         class basic_deadline_timer
  18.       |               ^~~~~~~~~~~~~~~~~~~~
  19. In file included from /home/grad/TBC_New/src/common/Asio/AsioHacksFwd.h:31,
  20.                  from /home/grad/TBC_New/src/common/Logging/Log.h:23,
  21.                  from /home/grad/TBC_New/src/common/Collision/DynamicTree.cpp:24:
  22. /usr/include/boost/asio/basic_deadline_timer.hpp:128:5: note: original definition appeared here
  23.   128 |     typename TimeTraits = boost::asio::time_traits<Time>,
  24.       |     ^~~~~~~~
  25. In file included from /home/grad/TBC_New/src/common/Logging/Log.h:23,
  26.                  from /home/grad/TBC_New/src/common/Collision/Management/VMapManager2.cpp:28:
  27. /home/grad/TBC_New/src/common/Asio/AsioHacksFwd.h:51:15: error: redefinition of default argument for ‘class TimeTraits’
  28.    51 |         class basic_deadline_timer
  29.       |               ^~~~~~~~~~~~~~~~~~~~
  30. In file included from /home/grad/TBC_New/src/common/Asio/AsioHacksFwd.h:31,
  31.                  from /home/grad/TBC_New/src/common/Logging/Log.h:23,
  32.                  from /home/grad/TBC_New/src/common/Collision/Management/VMapManager2.cpp:28:
  33. /usr/include/boost/asio/basic_deadline_timer.hpp:128:5: note: original definition appeared here
  34.   128 |     typename TimeTraits = boost::asio::time_traits<Time>,
  35.       |     ^~~~~~~~
  36. In file included from /home/grad/TBC_New/src/common/Logging/Log.h:23,
  37.                  from /home/grad/TBC_New/src/common/Collision/Management/MMapManager.cpp:20:
  38. /home/grad/TBC_New/src/common/Asio/AsioHacksFwd.h:51:15: error: redefinition of default argument for ‘class TimeTraits’
  39.    51 |         class basic_deadline_timer
  40.       |               ^~~~~~~~~~~~~~~~~~~~
  41. In file included from /home/grad/TBC_New/src/common/Asio/AsioHacksFwd.h:31,
  42.                  from /home/grad/TBC_New/src/common/Logging/Log.h:23,
  43.                  from /home/grad/TBC_New/src/common/Collision/Management/MMapManager.cpp:20:
  44. /usr/include/boost/asio/basic_deadline_timer.hpp:128:5: note: original definition appeared here
  45.   128 |     typename TimeTraits = boost::asio::time_traits<Time>,
  46.       |     ^~~~~~~~
  47. [ 11%] Building CXX object src/common/CMakeFiles/common.dir/Collision/Models/WorldModel.cpp.o
  48. In file included from /home/grad/TBC_New/src/common/Logging/Log.h:23,
  49.                  from /home/grad/TBC_New/src/common/Collision/Models/GameObjectModel.cpp:26:
  50. /home/grad/TBC_New/src/common/Asio/AsioHacksFwd.h:51:15: error: redefinition of default argument for ‘class TimeTraits’
  51.    51 |         class basic_deadline_timer
  52.       |               ^~~~~~~~~~~~~~~~~~~~
  53. In file included from /home/grad/TBC_New/src/common/Asio/AsioHacksFwd.h:31,
  54.                  from /home/grad/TBC_New/src/common/Logging/Log.h:23,
  55.                  from /home/grad/TBC_New/src/common/Collision/Models/GameObjectModel.cpp:26:
  56. /usr/include/boost/asio/basic_deadline_timer.hpp:128:5: note: original definition appeared here
  57.   128 |     typename TimeTraits = boost::asio::time_traits<Time>,
  58.       |     ^~~~~~~~
  59. [ 11%] Building CXX object src/common/CMakeFiles/common.dir/Collision/PrecompiledHeaders/collisionPCH.cpp.o
  60. [ 12%] Building CXX object src/common/CMakeFiles/common.dir/Configuration/BuiltInConfig.cpp.o
  61. [ 12%] Building CXX object src/common/CMakeFiles/common.dir/Configuration/Config.cpp.o
  62. make[2]: *** [src/common/CMakeFiles/common.dir/build.make:153: src/common/CMakeFiles/common.dir/Collision/DynamicTree.cpp.o] Ошибка 1
  63. make[2]: *** Ожидание завершения заданий…
  64. [ 12%] Building CXX object src/common/CMakeFiles/common.dir/Cryptography/ARC4.cpp.o
  65. make[2]: *** [src/common/CMakeFiles/common.dir/build.make:209: src/common/CMakeFiles/common.dir/Collision/Management/VMapManager2.cpp.o] Ошибка 1
  66. make[2]: *** [src/common/CMakeFiles/common.dir/build.make:223: src/common/CMakeFiles/common.dir/Collision/Maps/MapTree.cpp.o] Ошибка 1
  67. make[2]: *** [src/common/CMakeFiles/common.dir/build.make:251: src/common/CMakeFiles/common.dir/Collision/Models/GameObjectModel.cpp.o] Ошибка 1
  68. make[2]: *** [src/common/CMakeFiles/common.dir/build.make:181: src/common/CMakeFiles/common.dir/Collision/Management/MMapManager.cpp.o] Ошибка 1
  69. In file included from /home/grad/TBC_New/src/common/Logging/Log.h:23,
  70.                  from /home/grad/TBC_New/src/common/Configuration/Config.cpp:25:
  71. /home/grad/TBC_New/src/common/Asio/AsioHacksFwd.h:51:15: error: redefinition of default argument for ‘class TimeTraits’
  72.    51 |         class basic_deadline_timer
  73.       |               ^~~~~~~~~~~~~~~~~~~~
  74. In file included from /home/grad/TBC_New/src/common/Asio/AsioHacksFwd.h:31,
  75.                  from /home/grad/TBC_New/src/common/Logging/Log.h:23,
  76.                  from /home/grad/TBC_New/src/common/Configuration/Config.cpp:25:
  77. /usr/include/boost/asio/basic_deadline_timer.hpp:128:5: note: original definition appeared here
  78.   128 |     typename TimeTraits = boost::asio::time_traits<Time>,
  79.       |     ^~~~~~~~
  80. make[2]: *** [src/common/CMakeFiles/common.dir/build.make:321: src/common/CMakeFiles/common.dir/Configuration/Config.cpp.o] Ошибка 1
  81. make[1]: *** [CMakeFiles/Makefile2:934: src/common/CMakeFiles/common.dir/all] Ошибка 2
  82. make: *** [Makefile:149: all] Ошибка 2
  83.  

A PHP Error was encountered

Severity: Core Warning

Message: PHP Startup: Unable to load dynamic library 'mcrypt.so' (tried: /usr/lib/php/20170718/mcrypt.so (/usr/lib/php/20170718/mcrypt.so: cannot open shared object file: No such file or directory), /usr/lib/php/20170718/mcrypt.so.so (/usr/lib/php/20170718/mcrypt.so.so: cannot open shared object file: No such file or directory))

Filename: Unknown

Line Number: 0

Backtrace: