A PHP Error was encountered

Severity: 8192

Message: Return type of CI_Session_database_driver::open($save_path, $name) should either be compatible with SessionHandlerInterface::open(string $path, string $name): bool, or the #[\ReturnTypeWillChange] attribute should be used to temporarily suppress the notice

Filename: drivers/Session_database_driver.php

Line Number: 129

Backtrace:

File: /var/www/clients/client2/web23/web/paste/application/controllers/Main.php
Line: 98
Function: library

File: /var/www/clients/client2/web23/web/paste/index.php
Line: 315
Function: require_once

A PHP Error was encountered

Severity: 8192

Message: Return type of CI_Session_database_driver::close() should either be compatible with SessionHandlerInterface::close(): bool, or the #[\ReturnTypeWillChange] attribute should be used to temporarily suppress the notice

Filename: drivers/Session_database_driver.php

Line Number: 280

Backtrace:

File: /var/www/clients/client2/web23/web/paste/application/controllers/Main.php
Line: 98
Function: library

File: /var/www/clients/client2/web23/web/paste/index.php
Line: 315
Function: require_once

A PHP Error was encountered

Severity: 8192

Message: Return type of CI_Session_database_driver::read($session_id) should either be compatible with SessionHandlerInterface::read(string $id): string|false, or the #[\ReturnTypeWillChange] attribute should be used to temporarily suppress the notice

Filename: drivers/Session_database_driver.php

Line Number: 151

Backtrace:

File: /var/www/clients/client2/web23/web/paste/application/controllers/Main.php
Line: 98
Function: library

File: /var/www/clients/client2/web23/web/paste/index.php
Line: 315
Function: require_once

A PHP Error was encountered

Severity: 8192

Message: Return type of CI_Session_database_driver::write($session_id, $session_data) should either be compatible with SessionHandlerInterface::write(string $id, string $data): bool, or the #[\ReturnTypeWillChange] attribute should be used to temporarily suppress the notice

Filename: drivers/Session_database_driver.php

Line Number: 208

Backtrace:

File: /var/www/clients/client2/web23/web/paste/application/controllers/Main.php
Line: 98
Function: library

File: /var/www/clients/client2/web23/web/paste/index.php
Line: 315
Function: require_once

A PHP Error was encountered

Severity: 8192

Message: Return type of CI_Session_database_driver::destroy($session_id) should either be compatible with SessionHandlerInterface::destroy(string $id): bool, or the #[\ReturnTypeWillChange] attribute should be used to temporarily suppress the notice

Filename: drivers/Session_database_driver.php

Line Number: 297

Backtrace:

File: /var/www/clients/client2/web23/web/paste/application/controllers/Main.php
Line: 98
Function: library

File: /var/www/clients/client2/web23/web/paste/index.php
Line: 315
Function: require_once

A PHP Error was encountered

Severity: 8192

Message: Return type of CI_Session_database_driver::gc($maxlifetime) should either be compatible with SessionHandlerInterface::gc(int $max_lifetime): int|false, or the #[\ReturnTypeWillChange] attribute should be used to temporarily suppress the notice

Filename: drivers/Session_database_driver.php

Line Number: 335

Backtrace:

File: /var/www/clients/client2/web23/web/paste/application/controllers/Main.php
Line: 98
Function: library

File: /var/www/clients/client2/web23/web/paste/index.php
Line: 315
Function: require_once

A PHP Error was encountered

Severity: Warning

Message: ini_set(): Session ini settings cannot be changed after headers have already been sent

Filename: Session/Session.php

Line Number: 282

Backtrace:

File: /var/www/clients/client2/web23/web/paste/application/controllers/Main.php
Line: 98
Function: library

File: /var/www/clients/client2/web23/web/paste/index.php
Line: 315
Function: require_once

A PHP Error was encountered

Severity: Warning

Message: session_set_cookie_params(): Session cookie parameters cannot be changed after headers have already been sent

Filename: Session/Session.php

Line Number: 294

Backtrace:

File: /var/www/clients/client2/web23/web/paste/application/controllers/Main.php
Line: 98
Function: library

File: /var/www/clients/client2/web23/web/paste/index.php
Line: 315
Function: require_once

A PHP Error was encountered

Severity: Warning

Message: ini_set(): Session ini settings cannot be changed after headers have already been sent

Filename: Session/Session.php

Line Number: 304

Backtrace:

File: /var/www/clients/client2/web23/web/paste/application/controllers/Main.php
Line: 98
Function: library

File: /var/www/clients/client2/web23/web/paste/index.php
Line: 315
Function: require_once

A PHP Error was encountered

Severity: Warning

Message: ini_set(): Session ini settings cannot be changed after headers have already been sent

Filename: Session/Session.php

Line Number: 314

Backtrace:

File: /var/www/clients/client2/web23/web/paste/application/controllers/Main.php
Line: 98
Function: library

File: /var/www/clients/client2/web23/web/paste/index.php
Line: 315
Function: require_once

A PHP Error was encountered

Severity: Warning

Message: ini_set(): Session ini settings cannot be changed after headers have already been sent

Filename: Session/Session.php

Line Number: 315

Backtrace:

File: /var/www/clients/client2/web23/web/paste/application/controllers/Main.php
Line: 98
Function: library

File: /var/www/clients/client2/web23/web/paste/index.php
Line: 315
Function: require_once

A PHP Error was encountered

Severity: Warning

Message: ini_set(): Session ini settings cannot be changed after headers have already been sent

Filename: Session/Session.php

Line Number: 316

Backtrace:

File: /var/www/clients/client2/web23/web/paste/application/controllers/Main.php
Line: 98
Function: library

File: /var/www/clients/client2/web23/web/paste/index.php
Line: 315
Function: require_once

A PHP Error was encountered

Severity: Warning

Message: ini_set(): Session ini settings cannot be changed after headers have already been sent

Filename: Session/Session.php

Line Number: 317

Backtrace:

File: /var/www/clients/client2/web23/web/paste/application/controllers/Main.php
Line: 98
Function: library

File: /var/www/clients/client2/web23/web/paste/index.php
Line: 315
Function: require_once

A PHP Error was encountered

Severity: Warning

Message: ini_set(): Session ini settings cannot be changed after headers have already been sent

Filename: Session/Session.php

Line Number: 375

Backtrace:

File: /var/www/clients/client2/web23/web/paste/application/controllers/Main.php
Line: 98
Function: library

File: /var/www/clients/client2/web23/web/paste/index.php
Line: 315
Function: require_once

A PHP Error was encountered

Severity: Warning

Message: session_set_save_handler(): Session save handler cannot be changed after headers have already been sent

Filename: Session/Session.php

Line Number: 110

Backtrace:

File: /var/www/clients/client2/web23/web/paste/application/controllers/Main.php
Line: 98
Function: library

File: /var/www/clients/client2/web23/web/paste/index.php
Line: 315
Function: require_once

A PHP Error was encountered

Severity: Warning

Message: session_start(): Session cannot be started after headers have already been sent

Filename: Session/Session.php

Line Number: 143

Backtrace:

File: /var/www/clients/client2/web23/web/paste/application/controllers/Main.php
Line: 98
Function: library

File: /var/www/clients/client2/web23/web/paste/index.php
Line: 315
Function: require_once

A PHP Error was encountered

Severity: 8192

Message: stristr(): Passing null to parameter #1 ($haystack) of type string is deprecated

Filename: controllers/Main.php

Line Number: 269

Backtrace:

File: /var/www/clients/client2/web23/web/paste/application/controllers/Main.php
Line: 269
Function: stristr

File: /var/www/clients/client2/web23/web/paste/index.php
Line: 315
Function: require_once

A PHP Error was encountered

Severity: 8192

Message: stristr(): Passing null to parameter #1 ($haystack) of type string is deprecated

Filename: controllers/Main.php

Line Number: 297

Backtrace:

File: /var/www/clients/client2/web23/web/paste/application/controllers/Main.php
Line: 297
Function: stristr

File: /var/www/clients/client2/web23/web/paste/index.php
Line: 315
Function: require_once

A PHP Error was encountered

Severity: 8192

Message: stristr(): Passing null to parameter #1 ($haystack) of type string is deprecated

Filename: controllers/Main.php

Line Number: 321

Backtrace:

File: /var/www/clients/client2/web23/web/paste/application/controllers/Main.php
Line: 321
Function: stristr

File: /var/www/clients/client2/web23/web/paste/index.php
Line: 315
Function: require_once

A PHP Error was encountered

Severity: 8192

Message: filter_var(): Passing null to parameter #3 ($options) of type array|int is deprecated

Filename: core/Input.php

Line Number: 572

Backtrace:

File: /var/www/clients/client2/web23/web/paste/application/models/Pastes.php
Line: 630
Function: ip_address

File: /var/www/clients/client2/web23/web/paste/application/controllers/Main.php
Line: 697
Function: getPaste

File: /var/www/clients/client2/web23/web/paste/index.php
Line: 315
Function: require_once

Untitled - MLX Paste
From grad, 2 Years ago, written in Plain Text.
Embed
  1. [ 11%] Building CXX object src/common/CMakeFiles/common.dir/Collision/Maps/TileAssembler.cpp.o
  2. [ 11%] Building CXX object src/common/CMakeFiles/common.dir/Collision/Models/GameObjectModel.cpp.o
  3. [ 11%] Building CXX object src/common/CMakeFiles/common.dir/Collision/Models/ModelInstance.cpp.o
  4. In file included from /home/grad/TBC_New/src/common/Logging/Log.h:23,
  5.                  from /home/grad/TBC_New/src/common/Collision/Management/VMapManager2.cpp:28:
  6. /home/grad/TBC_New/src/common/Asio/AsioHacksFwd.h:56:15: error: redefinition of default argument for ‘class TimeTraits’
  7.    56 |         class basic_deadline_timer
  8.       |               ^~~~~~~~~~~~~~~~~~~~
  9. In file included from /home/grad/TBC_New/src/common/Asio/AsioHacksFwd.h:23,
  10.                  from /home/grad/TBC_New/src/common/Logging/Log.h:23,
  11.                  from /home/grad/TBC_New/src/common/Collision/Management/VMapManager2.cpp:28:
  12. /usr/include/boost/asio/basic_deadline_timer.hpp:128:5: note: original definition appeared here
  13.   128 |     typename TimeTraits = boost::asio::time_traits<Time>,
  14.       |     ^~~~~~~~
  15. In file included from /home/grad/TBC_New/src/common/Logging/Log.h:23,
  16.                  from /home/grad/TBC_New/src/common/Collision/DynamicTree.cpp:24:
  17. /home/grad/TBC_New/src/common/Asio/AsioHacksFwd.h:56:15: error: redefinition of default argument for ‘class TimeTraits’
  18.    56 |         class basic_deadline_timer
  19.       |               ^~~~~~~~~~~~~~~~~~~~
  20. In file included from /home/grad/TBC_New/src/common/Asio/AsioHacksFwd.h:23,
  21.                  from /home/grad/TBC_New/src/common/Logging/Log.h:23,
  22.                  from /home/grad/TBC_New/src/common/Collision/DynamicTree.cpp:24:
  23. /usr/include/boost/asio/basic_deadline_timer.hpp:128:5: note: original definition appeared here
  24.   128 |     typename TimeTraits = boost::asio::time_traits<Time>,
  25.       |     ^~~~~~~~
  26. In file included from /home/grad/TBC_New/src/common/Logging/Log.h:23,
  27.                  from /home/grad/TBC_New/src/common/Collision/Maps/MapTree.cpp:23:
  28. /home/grad/TBC_New/src/common/Asio/AsioHacksFwd.h:56:15: error: redefinition of default argument for ‘class TimeTraits’
  29.    56 |         class basic_deadline_timer
  30.       |               ^~~~~~~~~~~~~~~~~~~~
  31. In file included from /home/grad/TBC_New/src/common/Asio/AsioHacksFwd.h:23,
  32.                  from /home/grad/TBC_New/src/common/Logging/Log.h:23,
  33.                  from /home/grad/TBC_New/src/common/Collision/Maps/MapTree.cpp:23:
  34. /usr/include/boost/asio/basic_deadline_timer.hpp:128:5: note: original definition appeared here
  35.   128 |     typename TimeTraits = boost::asio::time_traits<Time>,
  36.       |     ^~~~~~~~
  37. [ 11%] Building CXX object src/common/CMakeFiles/common.dir/Collision/Models/WorldModel.cpp.o
  38. In file included from /home/grad/TBC_New/src/common/Logging/Log.h:23,
  39.                  from /home/grad/TBC_New/src/common/Collision/Management/MMapManager.cpp:20:
  40. /home/grad/TBC_New/src/common/Asio/AsioHacksFwd.h:56:15: error: redefinition of default argument for ‘class TimeTraits’
  41.    56 |         class basic_deadline_timer
  42.       |               ^~~~~~~~~~~~~~~~~~~~
  43. In file included from /home/grad/TBC_New/src/common/Asio/AsioHacksFwd.h:23,
  44.                  from /home/grad/TBC_New/src/common/Logging/Log.h:23,
  45.                  from /home/grad/TBC_New/src/common/Collision/Management/MMapManager.cpp:20:
  46. /usr/include/boost/asio/basic_deadline_timer.hpp:128:5: note: original definition appeared here
  47.   128 |     typename TimeTraits = boost::asio::time_traits<Time>,
  48.       |     ^~~~~~~~
  49. [ 11%] Building CXX object src/common/CMakeFiles/common.dir/Collision/PrecompiledHeaders/collisionPCH.cpp.o
  50. In file included from /home/grad/TBC_New/src/common/Logging/Log.h:23,
  51.                  from /home/grad/TBC_New/src/common/Collision/Models/GameObjectModel.cpp:26:
  52. /home/grad/TBC_New/src/common/Asio/AsioHacksFwd.h:56:15: error: redefinition of default argument for ‘class TimeTraits’
  53.    56 |         class basic_deadline_timer
  54.       |               ^~~~~~~~~~~~~~~~~~~~
  55. In file included from /home/grad/TBC_New/src/common/Asio/AsioHacksFwd.h:23,
  56.                  from /home/grad/TBC_New/src/common/Logging/Log.h:23,
  57.                  from /home/grad/TBC_New/src/common/Collision/Models/GameObjectModel.cpp:26:
  58. /usr/include/boost/asio/basic_deadline_timer.hpp:128:5: note: original definition appeared here
  59.   128 |     typename TimeTraits = boost::asio::time_traits<Time>,
  60.       |     ^~~~~~~~
  61. [ 12%] Building CXX object src/common/CMakeFiles/common.dir/Configuration/BuiltInConfig.cpp.o
  62. [ 12%] Building CXX object src/common/CMakeFiles/common.dir/Configuration/Config.cpp.o
  63. [ 12%] Building CXX object src/common/CMakeFiles/common.dir/Cryptography/ARC4.cpp.o
  64. make[2]: *** [src/common/CMakeFiles/common.dir/build.make:209: src/common/CMakeFiles/common.dir/Collision/Management/VMapManager2.cpp.o] Ошибка 1
  65. make[2]: *** Ожидание завершения заданий…
  66. make[2]: *** [src/common/CMakeFiles/common.dir/build.make:153: src/common/CMakeFiles/common.dir/Collision/DynamicTree.cpp.o] Ошибка 1
  67. make[2]: *** [src/common/CMakeFiles/common.dir/build.make:223: src/common/CMakeFiles/common.dir/Collision/Maps/MapTree.cpp.o] Ошибка 1
  68. make[2]: *** [src/common/CMakeFiles/common.dir/build.make:251: src/common/CMakeFiles/common.dir/Collision/Models/GameObjectModel.cpp.o] Ошибка 1
  69. make[2]: *** [src/common/CMakeFiles/common.dir/build.make:181: src/common/CMakeFiles/common.dir/Collision/Management/MMapManager.cpp.o] Ошибка 1
  70. In file included from /home/grad/TBC_New/src/common/Logging/Log.h:23,
  71.                  from /home/grad/TBC_New/src/common/Configuration/Config.cpp:25:
  72. /home/grad/TBC_New/src/common/Asio/AsioHacksFwd.h:56:15: error: redefinition of default argument for ‘class TimeTraits’
  73.    56 |         class basic_deadline_timer
  74.       |               ^~~~~~~~~~~~~~~~~~~~
  75. In file included from /home/grad/TBC_New/src/common/Asio/AsioHacksFwd.h:23,
  76.                  from /home/grad/TBC_New/src/common/Logging/Log.h:23,
  77.                  from /home/grad/TBC_New/src/common/Configuration/Config.cpp:25:
  78. /usr/include/boost/asio/basic_deadline_timer.hpp:128:5: note: original definition appeared here
  79.   128 |     typename TimeTraits = boost::asio::time_traits<Time>,
  80.       |     ^~~~~~~~
  81. make[2]: *** [src/common/CMakeFiles/common.dir/build.make:321: src/common/CMakeFiles/common.dir/Configuration/Config.cpp.o] Ошибка 1
  82. make[1]: *** [CMakeFiles/Makefile2:934: src/common/CMakeFiles/common.dir/all] Ошибка 2
  83. make: *** [Makefile:149: all] Ошибка 2
  84.