From grad, 11 Months ago, written in Plain Text.
Embed
  1. [ 11%] Building CXX object src/common/CMakeFiles/common.dir/Collision/Maps/MapTree.cpp.o
  2. [ 11%] Building CXX object src/common/CMakeFiles/common.dir/Collision/Management/MMapManager.cpp.o
  3. [ 11%] Building CXX object src/common/CMakeFiles/common.dir/Collision/DynamicTree.cpp.o
  4. [ 11%] Building CXX object src/common/CMakeFiles/common.dir/Collision/Maps/TileAssembler.cpp.o
  5. [ 11%] Building CXX object src/common/CMakeFiles/common.dir/Collision/Models/GameObjectModel.cpp.o
  6. In file included from /home/grad/TBC_New/src/common/Logging/Log.h:23,
  7.                  from /home/grad/TBC_New/src/common/Collision/Maps/MapTree.cpp:23:
  8. /home/grad/TBC_New/src/common/Asio/AsioHacksFwd.h:56:15: error: redefinition of default argument for ‘class TimeTraits’
  9.    56 |         class basic_deadline_timer;
  10.       |               ^~~~~~~~~~~~~~~~~~~~
  11. In file included from /home/grad/TBC_New/src/common/Asio/AsioHacksFwd.h:23,
  12.                  from /home/grad/TBC_New/src/common/Logging/Log.h:23,
  13.                  from /home/grad/TBC_New/src/common/Collision/Maps/MapTree.cpp:23:
  14. /usr/include/boost/asio/basic_deadline_timer.hpp:128:5: note: original definition appeared here
  15.   128 |     typename TimeTraits = boost::asio::time_traits<Time>,
  16.       |     ^~~~~~~~
  17. [ 11%] Building CXX object src/common/CMakeFiles/common.dir/Collision/Models/ModelInstance.cpp.o
  18. In file included from /home/grad/TBC_New/src/common/Logging/Log.h:23,
  19.                  from /home/grad/TBC_New/src/common/Collision/DynamicTree.cpp:24:
  20. /home/grad/TBC_New/src/common/Asio/AsioHacksFwd.h:56:15: error: redefinition of default argument for ‘class TimeTraits’
  21.    56 |         class basic_deadline_timer;
  22.       |               ^~~~~~~~~~~~~~~~~~~~
  23. In file included from /home/grad/TBC_New/src/common/Asio/AsioHacksFwd.h:23,
  24.                  from /home/grad/TBC_New/src/common/Logging/Log.h:23,
  25.                  from /home/grad/TBC_New/src/common/Collision/DynamicTree.cpp:24:
  26. /usr/include/boost/asio/basic_deadline_timer.hpp:128:5: note: original definition appeared here
  27.   128 |     typename TimeTraits = boost::asio::time_traits<Time>,
  28.       |     ^~~~~~~~
  29. In file included from /home/grad/TBC_New/src/common/Logging/Log.h:23,
  30.                  from /home/grad/TBC_New/src/common/Collision/Management/VMapManager2.cpp:28:
  31. /home/grad/TBC_New/src/common/Asio/AsioHacksFwd.h:56:15: error: redefinition of default argument for ‘class TimeTraits’
  32.    56 |         class basic_deadline_timer;
  33.       |               ^~~~~~~~~~~~~~~~~~~~
  34. In file included from /home/grad/TBC_New/src/common/Asio/AsioHacksFwd.h:23,
  35.                  from /home/grad/TBC_New/src/common/Logging/Log.h:23,
  36.                  from /home/grad/TBC_New/src/common/Collision/Management/VMapManager2.cpp:28:
  37. /usr/include/boost/asio/basic_deadline_timer.hpp:128:5: note: original definition appeared here
  38.   128 |     typename TimeTraits = boost::asio::time_traits<Time>,
  39.       |     ^~~~~~~~
  40. In file included from /home/grad/TBC_New/src/common/Logging/Log.h:23,
  41.                  from /home/grad/TBC_New/src/common/Collision/Management/MMapManager.cpp:20:
  42. /home/grad/TBC_New/src/common/Asio/AsioHacksFwd.h:56:15: error: redefinition of default argument for ‘class TimeTraits’
  43.    56 |         class basic_deadline_timer;
  44.       |               ^~~~~~~~~~~~~~~~~~~~
  45. In file included from /home/grad/TBC_New/src/common/Asio/AsioHacksFwd.h:23,
  46.                  from /home/grad/TBC_New/src/common/Logging/Log.h:23,
  47.                  from /home/grad/TBC_New/src/common/Collision/Management/MMapManager.cpp:20:
  48. /usr/include/boost/asio/basic_deadline_timer.hpp:128:5: note: original definition appeared here
  49.   128 |     typename TimeTraits = boost::asio::time_traits<Time>,
  50.       |     ^~~~~~~~
  51. [ 11%] Building CXX object src/common/CMakeFiles/common.dir/Collision/Models/WorldModel.cpp.o
  52. [ 11%] Building CXX object src/common/CMakeFiles/common.dir/Collision/PrecompiledHeaders/collisionPCH.cpp.o
  53. In file included from /home/grad/TBC_New/src/common/Logging/Log.h:23,
  54.                  from /home/grad/TBC_New/src/common/Collision/Models/GameObjectModel.cpp:26:
  55. /home/grad/TBC_New/src/common/Asio/AsioHacksFwd.h:56:15: error: redefinition of default argument for ‘class TimeTraits’
  56.    56 |         class basic_deadline_timer;
  57.       |               ^~~~~~~~~~~~~~~~~~~~
  58. In file included from /home/grad/TBC_New/src/common/Asio/AsioHacksFwd.h:23,
  59.                  from /home/grad/TBC_New/src/common/Logging/Log.h:23,
  60.                  from /home/grad/TBC_New/src/common/Collision/Models/GameObjectModel.cpp:26:
  61. /usr/include/boost/asio/basic_deadline_timer.hpp:128:5: note: original definition appeared here
  62.   128 |     typename TimeTraits = boost::asio::time_traits<Time>,
  63.       |     ^~~~~~~~
  64. [ 12%] Building CXX object src/common/CMakeFiles/common.dir/Configuration/BuiltInConfig.cpp.o
  65. make[2]: *** [src/common/CMakeFiles/common.dir/build.make:223: src/common/CMakeFiles/common.dir/Collision/Maps/MapTree.cpp.o] Ошибка 1
  66. make[2]: *** Ожидание завершения заданий…
  67. make[2]: *** [src/common/CMakeFiles/common.dir/build.make:153: src/common/CMakeFiles/common.dir/Collision/DynamicTree.cpp.o] Ошибка 1
  68. make[2]: *** [src/common/CMakeFiles/common.dir/build.make:209: src/common/CMakeFiles/common.dir/Collision/Management/VMapManager2.cpp.o] Ошибка 1
  69. make[2]: *** [src/common/CMakeFiles/common.dir/build.make:251: src/common/CMakeFiles/common.dir/Collision/Models/GameObjectModel.cpp.o] Ошибка 1
  70. make[2]: *** [src/common/CMakeFiles/common.dir/build.make:181: src/common/CMakeFiles/common.dir/Collision/Management/MMapManager.cpp.o] Ошибка 1
  71. make[1]: *** [CMakeFiles/Makefile2:934: src/common/CMakeFiles/common.dir/all] Ошибка 2
  72. make: *** [Makefile:149: all] Ошибка 2
  73. [email protected]:~/TBC_New/build$
  74.  

A PHP Error was encountered

Severity: Core Warning

Message: PHP Startup: Unable to load dynamic library 'mcrypt.so' (tried: /usr/lib/php/20170718/mcrypt.so (/usr/lib/php/20170718/mcrypt.so: cannot open shared object file: No such file or directory), /usr/lib/php/20170718/mcrypt.so.so (/usr/lib/php/20170718/mcrypt.so.so: cannot open shared object file: No such file or directory))

Filename: Unknown

Line Number: 0

Backtrace: