From grad, 7 Months ago, written in Plain Text.
Embed
  1. [ 15%] Building CXX object src/common/CMakeFiles/common.dir/Utilities/Random.cpp.o
  2. [ 15%] Building CXX object src/common/CMakeFiles/common.dir/Utilities/StartProcess.cpp.o
  3. [ 15%] Building CXX object src/common/CMakeFiles/common.dir/Utilities/TaskScheduler.cpp.o
  4. [ 15%] Building CXX object src/common/CMakeFiles/common.dir/Utilities/Util.cpp.o
  5. [ 15%] Building CXX object src/common/CMakeFiles/common.dir/Debugging/Errors.cpp.o
  6. /home/grad/tbc/src/common/Debugging/Errors.cpp:44:38: warning: ‘TrinityAssertionFailedMessage’ initialized and declared ‘extern’
  7.    44 | extern "C" TC_COMMON_API char const* TrinityAssertionFailedMessage = nullptr;
  8.       |                                      ^~~~~~~~~~~~~~~~~~~~~~~~~~~~~
  9. [ 15%] Linking CXX static library libcommon.a
  10. [ 15%] Built target common
  11. [ 15%] Generating CXX prefix source src/server/database/cotire/database_CXX_prefix.cxx
  12. [ 15%] Generating CXX prefix header src/server/database/cotire/database_CXX_prefix.hxx
  13. [ 15%] Building CXX precompiled header src/server/database/cotire/database_CXX_prefix.hxx.gch
  14. Scanning dependencies of target database
  15. [ 15%] Building CXX object src/server/database/CMakeFiles/database.dir/Database/PreparedStatement.cpp.o
  16. [ 15%] Building CXX object src/server/database/CMakeFiles/database.dir/Database/MySQLConnection.cpp.o
  17. [ 15%] Building CXX object src/server/database/CMakeFiles/database.dir/Database/DatabaseEnv.cpp.o
  18. [ 15%] Building CXX object src/server/database/CMakeFiles/database.dir/Database/DatabaseLoader.cpp.o
  19. [ 15%] Building CXX object src/server/database/CMakeFiles/database.dir/Database/DatabaseWorker.cpp.o
  20. [ 16%] Building CXX object src/server/database/CMakeFiles/database.dir/Database/AdhocStatement.cpp.o
  21. [ 16%] Building CXX object src/server/database/CMakeFiles/database.dir/Database/DatabaseWorkerPool.cpp.o
  22. [ 17%] Building CXX object src/server/database/CMakeFiles/database.dir/Database/Field.cpp.o
  23. [ 17%] Building CXX object src/server/database/CMakeFiles/database.dir/Database/MySQLThreading.cpp.o
  24. [ 17%] Building CXX object src/server/database/CMakeFiles/database.dir/Database/QueryCallback.cpp.o
  25. [ 17%] Building CXX object src/server/database/CMakeFiles/database.dir/Database/QueryCallbackProcessor.cpp.o
  26. [ 17%] Building CXX object src/server/database/CMakeFiles/database.dir/Database/QueryHolder.cpp.o
  27. [ 17%] Building CXX object src/server/database/CMakeFiles/database.dir/Database/QueryResult.cpp.o
  28. [ 17%] Building CXX object src/server/database/CMakeFiles/database.dir/Database/Transaction.cpp.o
  29. [ 18%] Building CXX object src/server/database/CMakeFiles/database.dir/Database/Implementation/CharacterDatabase.cpp.o
  30. [ 18%] Building CXX object src/server/database/CMakeFiles/database.dir/Database/Implementation/LoginDatabase.cpp.o
  31. [ 18%] Building CXX object src/server/database/CMakeFiles/database.dir/Database/Implementation/LogsDatabase.cpp.o
  32. [ 18%] Building CXX object src/server/database/CMakeFiles/database.dir/Database/Implementation/WorldDatabase.cpp.o
  33. [ 18%] Building CXX object src/server/database/CMakeFiles/database.dir/Logging/AppenderDB.cpp.o
  34. [ 18%] Building CXX object src/server/database/CMakeFiles/database.dir/Updater/DBUpdater.cpp.o
  35. [ 19%] Building CXX object src/server/database/CMakeFiles/database.dir/Updater/UpdateFetcher.cpp.o
  36. [ 19%] Linking CXX static library libdatabase.a
  37. [ 19%] Built target database
  38. [ 19%] Generating CXX prefix source src/server/shared/cotire/shared_CXX_prefix.cxx
  39. [ 19%] Generating CXX prefix header src/server/shared/cotire/shared_CXX_prefix.hxx
  40. [ 19%] Building CXX precompiled header src/server/shared/cotire/shared_CXX_prefix.hxx.gch
  41. Scanning dependencies of target shared
  42. [ 19%] Building CXX object src/server/shared/CMakeFiles/shared.dir/Packets/ByteBuffer.cpp.o
  43. [ 19%] Building CXX object src/server/shared/CMakeFiles/shared.dir/DataStores/DBCStore.cpp.o
  44. [ 20%] Building CXX object src/server/shared/CMakeFiles/shared.dir/DataStores/DBCDatabaseLoader.cpp.o
  45. [ 20%] Building CXX object src/server/shared/CMakeFiles/shared.dir/Realm/Realm.cpp.o
  46. [ 20%] Building CXX object src/server/shared/CMakeFiles/shared.dir/Realm/RealmList.cpp.o
  47. [ 20%] Linking CXX static library libshared.a
  48. [ 20%] Built target shared
  49. [ 20%] Generating CXX prefix source src/server/authserver/cotire/authserver_CXX_prefix.cxx
  50. [ 20%] Generating CXX prefix source src/server/game/cotire/game_CXX_prefix.cxx
  51. [ 21%] Generating CXX prefix source src/server/scripts/cotire/scripts_CXX_prefix.cxx
  52. [ 21%] Generating CXX prefix header src/server/authserver/cotire/authserver_CXX_prefix.hxx
  53. [ 21%] Generating CXX prefix header src/server/game/cotire/game_CXX_prefix.hxx
  54. [ 21%] Generating CXX prefix header src/server/scripts/cotire/scripts_CXX_prefix.hxx
  55. [ 22%] Building CXX precompiled header src/server/authserver/cotire/authserver_CXX_prefix.hxx.gch
  56. [ 23%] Building CXX precompiled header src/server/scripts/cotire/scripts_CXX_prefix.hxx.gch
  57. [ 23%] Building CXX precompiled header src/server/game/cotire/game_CXX_prefix.hxx.gch
  58. In file included from /home/grad/tbc/src/server/game/Entities/Item/Item.h:5,
  59.                  from /home/grad/tbc/src/server/game/DataStores/DBCStores.h:7,
  60.                  from /home/grad/tbc/src/server/game/PrecompiledHeaders/gamePCH.h:10,
  61.                  from /home/grad/tbc/build/src/server/game/cotire/game_CXX_prefix.cxx:4,
  62.                  from /home/grad/tbc/build/src/server/game/cotire/game_CXX_prefix.hxx:4:
  63. /home/grad/tbc/src/server/game/Entities/Object/Object.h: In member function ‘void WorldObject::VisitNearbyGridObject(const float&, NOTIFIER&) const’:
  64. /home/grad/tbc/src/server/game/Entities/Object/Object.h:649:137: error: ‘class Map’ has no member named ‘VisitGrid’
  65.   649 |         template<class NOTIFIER> void VisitNearbyGridObject(float const& radius, NOTIFIER& notifier) const { if (IsInWorld()) GetMap()->VisitGrid(GetPositionX(), GetPositionY(), radius, notifier); }
  66.       |                                                                                                                                         ^~~~~~~~~
  67. /home/grad/tbc/src/server/game/Entities/Object/Object.h: In member function ‘void WorldObject::VisitNearbyWorldObject(const float&, NOTIFIER&) const’:
  68. /home/grad/tbc/src/server/game/Entities/Object/Object.h:650:138: error: ‘class Map’ has no member named ‘VisitWorld’; did you mean ‘VisitAll’?
  69.   650 |         template<class NOTIFIER> void VisitNearbyWorldObject(float const& radius, NOTIFIER& notifier) const { if (IsInWorld()) GetMap()->VisitWorld(GetPositionX(), GetPositionY(), radius, notifier); }
  70.       |                                                                                                                                          ^~~~~~~~~~
  71.       |                                                                                                                                          VisitAll
  72. In file included from /home/grad/tbc/src/server/game/Entities/Unit/Unit.h:5,
  73.                  from /home/grad/tbc/src/server/game/Entities/Creature/Creature.h:6,
  74.                  from /home/grad/tbc/src/server/game/Globals/ObjectMgr.h:5,
  75.                  from /home/grad/tbc/src/server/game/Scripting/ScriptMgr.h:12,
  76.                  from /home/grad/tbc/src/server/scripts/ScriptPCH.h:9,
  77.                  from /home/grad/tbc/build/src/server/scripts/cotire/scripts_CXX_prefix.cxx:4,
  78.                  from /home/grad/tbc/build/src/server/scripts/cotire/scripts_CXX_prefix.hxx:4:
  79. /home/grad/tbc/src/server/game/Entities/Object/Object.h: In member function ‘void WorldObject::VisitNearbyGridObject(const float&, NOTIFIER&) const’:
  80. /home/grad/tbc/src/server/game/Entities/Object/Object.h:649:137: error: ‘class Map’ has no member named ‘VisitGrid’
  81.   649 |         template<class NOTIFIER> void VisitNearbyGridObject(float const& radius, NOTIFIER& notifier) const { if (IsInWorld()) GetMap()->VisitGrid(GetPositionX(), GetPositionY(), radius, notifier); }
  82.       |                                                                                                                                         ^~~~~~~~~
  83. /home/grad/tbc/src/server/game/Entities/Object/Object.h: In member function ‘void WorldObject::VisitNearbyWorldObject(const float&, NOTIFIER&) const’:
  84. /home/grad/tbc/src/server/game/Entities/Object/Object.h:650:138: error: ‘class Map’ has no member named ‘VisitWorld’; did you mean ‘VisitAll’?
  85.   650 |         template<class NOTIFIER> void VisitNearbyWorldObject(float const& radius, NOTIFIER& notifier) const { if (IsInWorld()) GetMap()->VisitWorld(GetPositionX(), GetPositionY(), radius, notifier); }
  86.       |                                                                                                                                          ^~~~~~~~~~
  87.       |                                                                                                                                          VisitAll
  88. Scanning dependencies of target authserver
  89. [ 23%] Building CXX object src/server/authserver/CMakeFiles/authserver.dir/Authentication/TOTP.cpp.o
  90. [ 23%] Building CXX object src/server/authserver/CMakeFiles/authserver.dir/Authentication/AuthCodes.cpp.o
  91. [ 23%] Building CXX object src/server/authserver/CMakeFiles/authserver.dir/Main.cpp.o
  92. [ 24%] Building CXX object src/server/authserver/CMakeFiles/authserver.dir/Server/AuthSession.cpp.o
  93. cc1plus: warning: /home/grad/tbc/build/src/server/authserver/cotire/authserver_CXX_prefix.hxx.gch: not used because `BOOST_ALL_NO_LIB' is defined [-Winvalid-pch]
  94. cc1plus: warning: /home/grad/tbc/build/src/server/authserver/cotire/authserver_CXX_prefix.hxx.gch: not used because `BOOST_ALL_NO_LIB' is defined [-Winvalid-pch]
  95. cc1plus: warning: /home/grad/tbc/build/src/server/authserver/cotire/authserver_CXX_prefix.hxx.gch: not used because `BOOST_ALL_NO_LIB' is defined [-Winvalid-pch]
  96. cc1plus: warning: /home/grad/tbc/build/src/server/authserver/cotire/authserver_CXX_prefix.hxx.gch: not used because `BOOST_ALL_NO_LIB' is defined [-Winvalid-pch]
  97. [ 24%] Linking CXX executable authserver
  98. CMake Error at /home/grad/tbc/dep/cotire/CMake/cotire.cmake:1990 (message):
  99.   cotire: error 1 precompiling
  100.   /home/grad/tbc/build/src/server/game/cotire/game_CXX_prefix.hxx.
  101. Call Stack (most recent call first):
  102.   /home/grad/tbc/dep/cotire/CMake/cotire.cmake:3694 (cotire_precompile_prefix_header)
  103.  
  104.  
  105. make[2]: *** [src/server/game/CMakeFiles/game.dir/build.make:83: src/server/game/cotire/game_CXX_prefix.hxx.gch] Ошибка 1
  106. make[1]: *** [CMakeFiles/Makefile2:1107: src/server/game/CMakeFiles/game.dir/all] Ошибка 2
  107. make[1]: *** Ожидание завершения заданий…
  108. CMake Error at /home/grad/tbc/dep/cotire/CMake/cotire.cmake:1990 (message):
  109.   cotire: error 1 precompiling
  110.   /home/grad/tbc/build/src/server/scripts/cotire/scripts_CXX_prefix.hxx.
  111. Call Stack (most recent call first):
  112.   /home/grad/tbc/dep/cotire/CMake/cotire.cmake:3694 (cotire_precompile_prefix_header)
  113.  
  114.  
  115. make[2]: *** [src/server/scripts/CMakeFiles/scripts.dir/build.make:83: src/server/scripts/cotire/scripts_CXX_prefix.hxx.gch] Ошибка 1
  116. make[1]: *** [CMakeFiles/Makefile2:1166: src/server/scripts/CMakeFiles/scripts.dir/all] Ошибка 2
  117. [ 24%] Built target authserver
  118. make: *** [Makefile:149: all] Ошибка 2
  119.  

A PHP Error was encountered

Severity: Core Warning

Message: PHP Startup: Unable to load dynamic library 'mcrypt.so' (tried: /usr/lib/php/20170718/mcrypt.so (/usr/lib/php/20170718/mcrypt.so: cannot open shared object file: No such file or directory), /usr/lib/php/20170718/mcrypt.so.so (/usr/lib/php/20170718/mcrypt.so.so: cannot open shared object file: No such file or directory))

Filename: Unknown

Line Number: 0

Backtrace: