From grad, 8 Months ago, written in Plain Text.
Embed
  1. [ 11%] Building CXX object src/common/CMakeFiles/common.dir/Collision/Models/ModelInstance.cpp.o
  2. In file included from /home/grad/TBC_New/src/common/Logging/Log.h:23,
  3.                  from /home/grad/TBC_New/src/common/Collision/DynamicTree.cpp:24:
  4. /home/grad/TBC_New/src/common/Asio/AsioHacksFwd.h:56:15: error: redefinition of default argument for ‘class TimeTraits’
  5.    56 |         class basic_deadline_timer
  6.       |               ^~~~~~~~~~~~~~~~~~~~
  7. In file included from /home/grad/TBC_New/src/common/Asio/AsioHacksFwd.h:23,
  8.                  from /home/grad/TBC_New/src/common/Logging/Log.h:23,
  9.                  from /home/grad/TBC_New/src/common/Collision/DynamicTree.cpp:24:
  10. /usr/include/boost/asio/basic_deadline_timer.hpp:128:5: note: original definition appeared here
  11.   128 |     typename TimeTraits = boost::asio::time_traits<Time>,
  12.       |     ^~~~~~~~
  13. In file included from /home/grad/TBC_New/src/common/Logging/Log.h:23,
  14.                  from /home/grad/TBC_New/src/common/Collision/Maps/MapTree.cpp:23:
  15. /home/grad/TBC_New/src/common/Asio/AsioHacksFwd.h:56:15: error: redefinition of default argument for ‘class TimeTraits’
  16.    56 |         class basic_deadline_timer
  17.       |               ^~~~~~~~~~~~~~~~~~~~
  18. In file included from /home/grad/TBC_New/src/common/Asio/AsioHacksFwd.h:23,
  19.                  from /home/grad/TBC_New/src/common/Logging/Log.h:23,
  20.                  from /home/grad/TBC_New/src/common/Collision/Maps/MapTree.cpp:23:
  21. /usr/include/boost/asio/basic_deadline_timer.hpp:128:5: note: original definition appeared here
  22.   128 |     typename TimeTraits = boost::asio::time_traits<Time>,
  23.       |     ^~~~~~~~
  24. In file included from /home/grad/TBC_New/src/common/Logging/Log.h:23,
  25.                  from /home/grad/TBC_New/src/common/Collision/Management/VMapManager2.cpp:28:
  26. /home/grad/TBC_New/src/common/Asio/AsioHacksFwd.h:56:15: error: redefinition of default argument for ‘class TimeTraits’
  27.    56 |         class basic_deadline_timer
  28.       |               ^~~~~~~~~~~~~~~~~~~~
  29. In file included from /home/grad/TBC_New/src/common/Asio/AsioHacksFwd.h:23,
  30.                  from /home/grad/TBC_New/src/common/Logging/Log.h:23,
  31.                  from /home/grad/TBC_New/src/common/Collision/Management/VMapManager2.cpp:28:
  32. /usr/include/boost/asio/basic_deadline_timer.hpp:128:5: note: original definition appeared here
  33.   128 |     typename TimeTraits = boost::asio::time_traits<Time>,
  34.       |     ^~~~~~~~
  35. [ 11%] Building CXX object src/common/CMakeFiles/common.dir/Collision/Models/WorldModel.cpp.o
  36. In file included from /home/grad/TBC_New/src/common/Logging/Log.h:23,
  37.                  from /home/grad/TBC_New/src/common/Collision/Management/MMapManager.cpp:20:
  38. /home/grad/TBC_New/src/common/Asio/AsioHacksFwd.h:56:15: error: redefinition of default argument for ‘class TimeTraits’
  39.    56 |         class basic_deadline_timer
  40.       |               ^~~~~~~~~~~~~~~~~~~~
  41. In file included from /home/grad/TBC_New/src/common/Asio/AsioHacksFwd.h:23,
  42.                  from /home/grad/TBC_New/src/common/Logging/Log.h:23,
  43.                  from /home/grad/TBC_New/src/common/Collision/Management/MMapManager.cpp:20:
  44. /usr/include/boost/asio/basic_deadline_timer.hpp:128:5: note: original definition appeared here
  45.   128 |     typename TimeTraits = boost::asio::time_traits<Time>,
  46.       |     ^~~~~~~~
  47. In file included from /home/grad/TBC_New/src/common/Logging/Log.h:23,
  48.                  from /home/grad/TBC_New/src/common/Collision/Models/GameObjectModel.cpp:26:
  49. /home/grad/TBC_New/src/common/Asio/AsioHacksFwd.h:56:15: error: redefinition of default argument for ‘class TimeTraits’
  50.    56 |         class basic_deadline_timer
  51.       |               ^~~~~~~~~~~~~~~~~~~~
  52. In file included from /home/grad/TBC_New/src/common/Asio/AsioHacksFwd.h:23,
  53.                  from /home/grad/TBC_New/src/common/Logging/Log.h:23,
  54.                  from /home/grad/TBC_New/src/common/Collision/Models/GameObjectModel.cpp:26:
  55. /usr/include/boost/asio/basic_deadline_timer.hpp:128:5: note: original definition appeared here
  56.   128 |     typename TimeTraits = boost::asio::time_traits<Time>,
  57.       |     ^~~~~~~~
  58. [ 11%] Building CXX object src/common/CMakeFiles/common.dir/Collision/PrecompiledHeaders/collisionPCH.cpp.o
  59. [ 12%] Building CXX object src/common/CMakeFiles/common.dir/Configuration/BuiltInConfig.cpp.o
  60. make[2]: *** [src/common/CMakeFiles/common.dir/build.make:153: src/common/CMakeFiles/common.dir/Collision/DynamicTree.cpp.o] Ошибка 1
  61. make[2]: *** Ожидание завершения заданий…
  62. make[2]: *** [src/common/CMakeFiles/common.dir/build.make:223: src/common/CMakeFiles/common.dir/Collision/Maps/MapTree.cpp.o] Ошибка 1
  63. make[2]: *** [src/common/CMakeFiles/common.dir/build.make:209: src/common/CMakeFiles/common.dir/Collision/Management/VMapManager2.cpp.o] Ошибка 1
  64. make[2]: *** [src/common/CMakeFiles/common.dir/build.make:251: src/common/CMakeFiles/common.dir/Collision/Models/GameObjectModel.cpp.o] Ошибка 1
  65. make[2]: *** [src/common/CMakeFiles/common.dir/build.make:181: src/common/CMakeFiles/common.dir/Collision/Management/MMapManager.cpp.o] Ошибка 1
  66. make[1]: *** [CMakeFiles/Makefile2:934: src/common/CMakeFiles/common.dir/all] Ошибка 2
  67. make: *** [Makefile:149: all] Ошибка 2
  68.  

A PHP Error was encountered

Severity: Core Warning

Message: PHP Startup: Unable to load dynamic library 'mcrypt.so' (tried: /usr/lib/php/20170718/mcrypt.so (/usr/lib/php/20170718/mcrypt.so: cannot open shared object file: No such file or directory), /usr/lib/php/20170718/mcrypt.so.so (/usr/lib/php/20170718/mcrypt.so.so: cannot open shared object file: No such file or directory))

Filename: Unknown

Line Number: 0

Backtrace: