From grad, 8 Months ago, written in Plain Text.
Embed
  1. [  8%] Building CXX object dep/g3dlite/CMakeFiles/g3dlib.dir/source/Vector3.cpp.o
  2. [  9%] Building CXX object dep/g3dlite/CMakeFiles/g3dlib.dir/source/Vector4.cpp.o
  3. [  9%] Linking CXX static library libg3dlib.a
  4. [  9%] Built target g3dlib
  5. [  9%] Generating CXX prefix source src/common/cotire/common_CXX_prefix.cxx
  6. [ 10%] Generating CXX prefix header src/common/cotire/common_CXX_prefix.hxx
  7. [ 10%] Building CXX precompiled header src/common/cotire/common_CXX_prefix.hxx.gch
  8. Scanning dependencies of target common
  9. [ 11%] Building CXX object src/common/CMakeFiles/common.dir/Collision/Management/VMapManager2.cpp.o
  10. [ 11%] Building CXX object src/common/CMakeFiles/common.dir/Collision/Management/VMapFactory.cpp.o
  11. [ 11%] Building CXX object src/common/CMakeFiles/common.dir/Collision/BoundingIntervalHierarchy.cpp.o
  12. [ 11%] Building CXX object src/common/CMakeFiles/common.dir/Banner.cpp.o
  13. [ 11%] Building CXX object src/common/CMakeFiles/common.dir/Common.cpp.o
  14. [ 11%] Building CXX object src/common/CMakeFiles/common.dir/GitRevision.cpp.o
  15. [ 11%] Building CXX object src/common/CMakeFiles/common.dir/Collision/DynamicTree.cpp.o
  16. [ 11%] Building CXX object src/common/CMakeFiles/common.dir/Collision/Maps/MapTree.cpp.o
  17. [ 11%] Building CXX object src/common/CMakeFiles/common.dir/Collision/Management/MMapFactory.cpp.o
  18. [ 11%] Building CXX object src/common/CMakeFiles/common.dir/Collision/Management/MMapManager.cpp.o
  19. In file included from /home/grad/TBC_New/src/common/Logging/Log.h:23,
  20.                  from /home/grad/TBC_New/src/common/Collision/DynamicTree.cpp:24:
  21. /home/grad/TBC_New/src/common/Asio/AsioHacksFwd.h:52:29: error: ‘executor’ does not name a type
  22.    52 |         typename Executor = executor>
  23.       |                             ^~~~~~~~
  24. /home/grad/TBC_New/src/common/Asio/AsioHacksFwd.h:54:74: error: template argument 3 is invalid
  25.    54 |         typedef basic_deadline_timer<time_traits<boost::posix_time::ptime>> deadline_timer;
  26.       |                                                                          ^~
  27. In file included from /home/grad/TBC_New/src/common/Logging/Log.h:23,
  28.                  from /home/grad/TBC_New/src/common/Collision/Maps/MapTree.cpp:23:
  29. /home/grad/TBC_New/src/common/Asio/AsioHacksFwd.h:52:29: error: ‘executor’ does not name a type
  30.    52 |         typename Executor = executor>
  31.       |                             ^~~~~~~~
  32. /home/grad/TBC_New/src/common/Asio/AsioHacksFwd.h:54:74: error: template argument 3 is invalid
  33.    54 |         typedef basic_deadline_timer<time_traits<boost::posix_time::ptime>> deadline_timer;
  34.       |                                                                          ^~
  35. In file included from /home/grad/TBC_New/src/common/Logging/Log.h:23,
  36.                  from /home/grad/TBC_New/src/common/Collision/Management/VMapManager2.cpp:28:
  37. /home/grad/TBC_New/src/common/Asio/AsioHacksFwd.h:52:29: error: ‘executor’ does not name a type
  38.    52 |         typename Executor = executor>
  39.       |                             ^~~~~~~~
  40. /home/grad/TBC_New/src/common/Asio/AsioHacksFwd.h:54:74: error: template argument 3 is invalid
  41.    54 |         typedef basic_deadline_timer<time_traits<boost::posix_time::ptime>> deadline_timer;
  42.       |                                                                          ^~
  43. [ 11%] Building CXX object src/common/CMakeFiles/common.dir/Collision/Maps/TileAssembler.cpp.o
  44. In file included from /home/grad/TBC_New/src/common/Logging/Log.h:23,
  45.                  from /home/grad/TBC_New/src/common/Collision/Management/MMapManager.cpp:20:
  46. /home/grad/TBC_New/src/common/Asio/AsioHacksFwd.h:52:29: error: ‘executor’ does not name a type
  47.    52 |         typename Executor = executor>
  48.       |                             ^~~~~~~~
  49. /home/grad/TBC_New/src/common/Asio/AsioHacksFwd.h:54:74: error: template argument 3 is invalid
  50.    54 |         typedef basic_deadline_timer<time_traits<boost::posix_time::ptime>> deadline_timer;
  51.       |                                                                          ^~
  52. [ 11%] Building CXX object src/common/CMakeFiles/common.dir/Collision/Models/GameObjectModel.cpp.o
  53. [ 11%] Building CXX object src/common/CMakeFiles/common.dir/Collision/Models/ModelInstance.cpp.o
  54. In file included from /home/grad/TBC_New/src/common/Logging/Log.h:23,
  55.                  from /home/grad/TBC_New/src/common/Collision/Models/GameObjectModel.cpp:26:
  56. /home/grad/TBC_New/src/common/Asio/AsioHacksFwd.h:52:29: error: ‘executor’ does not name a type
  57.    52 |         typename Executor = executor>
  58.       |                             ^~~~~~~~
  59. /home/grad/TBC_New/src/common/Asio/AsioHacksFwd.h:54:74: error: template argument 3 is invalid
  60.    54 |         typedef basic_deadline_timer<time_traits<boost::posix_time::ptime>> deadline_timer;
  61.       |                                                                          ^~
  62. [ 11%] Building CXX object src/common/CMakeFiles/common.dir/Collision/Models/WorldModel.cpp.o
  63. make[2]: *** [src/common/CMakeFiles/common.dir/build.make:153: src/common/CMakeFiles/common.dir/Collision/DynamicTree.cpp.o] Ошибка 1
  64. make[2]: *** Ожидание завершения заданий…
  65. make[2]: *** [src/common/CMakeFiles/common.dir/build.make:223: src/common/CMakeFiles/common.dir/Collision/Maps/MapTree.cpp.o] Ошибка 1
  66. make[2]: *** [src/common/CMakeFiles/common.dir/build.make:209: src/common/CMakeFiles/common.dir/Collision/Management/VMapManager2.cpp.o] Ошибка 1
  67. make[2]: *** [src/common/CMakeFiles/common.dir/build.make:251: src/common/CMakeFiles/common.dir/Collision/Models/GameObjectModel.cpp.o] Ошибка 1
  68. make[2]: *** [src/common/CMakeFiles/common.dir/build.make:181: src/common/CMakeFiles/common.dir/Collision/Management/MMapManager.cpp.o] Ошибка 1
  69. make[1]: *** [CMakeFiles/Makefile2:934: src/common/CMakeFiles/common.dir/all] Ошибка 2
  70. make: *** [Makefile:149: all] Ошибка 2
  71. [email protected]:~/TBC_New/build$
  72.  

A PHP Error was encountered

Severity: Core Warning

Message: PHP Startup: Unable to load dynamic library 'mcrypt.so' (tried: /usr/lib/php/20170718/mcrypt.so (/usr/lib/php/20170718/mcrypt.so: cannot open shared object file: No such file or directory), /usr/lib/php/20170718/mcrypt.so.so (/usr/lib/php/20170718/mcrypt.so.so: cannot open shared object file: No such file or directory))

Filename: Unknown

Line Number: 0

Backtrace: