From Tiny Camel, 4 Months ago, written in Plain Text.
Embed
  1. In file included from In file included from /home/grad/azerothcore-wotlk/src/server/scripts/EasternKingdoms/Karazhan/boss_netherspite.cpp:16:
  2. /home/grad/azerothcore-wotlk/src/server/scripts/EasternKingdoms/Karazhan/karazhan.h:60:21: error: missing ',' between enumerators
  3.     DATA_PRINCE = 30
  4.                     ^
  5.                     ,
  6. /home/grad/azerothcore-wotlk/src/server/scripts/EasternKingdoms/Karazhan/boss_maiden_of_virtue.cpp:7:
  7. /home/grad/azerothcore-wotlk/src/server/scripts/EasternKingdoms/Karazhan/karazhan.h:60:21: error: missing ',' between enumerators
  8.     DATA_PRINCE = 30/home/grad/azerothcore-wotlk/src/server/scripts/EasternKingdoms/Karazhan/chess_event.cpp:2:10: fatal error: 'ScriptPCH.h' file not found
  9. #include "ScriptPCH.h"
  10.          ^~~~~~~~~~~~~
  11.  
  12. In file included from In file included from /home/grad/azerothcore-wotlk/src/server/scripts/EasternKingdoms/Karazhan/boss_prince_malchezaar.cpp                    ^:
  13. 10:
  14.                     , /home/grad/azerothcore-wotlk/src/server/scripts/EasternKingdoms/Karazhan/karazhan.h
  15. :60:21: error: missing ',' between enumerators
  16.     DATA_PRINCE = 30
  17.                     ^
  18.                     ,
  19. /home/grad/azerothcore-wotlk/src/server/scripts/EasternKingdoms/Karazhan/boss_shade_of_aran.cpp:7:
  20. /home/grad/azerothcore-wotlk/src/server/scripts/EasternKingdoms/Karazhan/karazhan.h:60:21: error: missing ',' between enumerators
  21.     DATA_PRINCE = 30
  22.                     ^
  23.                     ,
  24. In file included from /home/grad/azerothcore-wotlk/src/server/scripts/EasternKingdoms/Karazhan/boss_curator.cpp:7:
  25. /home/grad/azerothcore-wotlk/src/server/scripts/EasternKingdoms/Karazhan/karazhan.h:60:21: error: missing ',' between enumerators
  26.     DATA_PRINCE = 30
  27.                     ^
  28.                     ,
  29. In file included from In file included from /home/grad/azerothcore-wotlk/src/server/scripts/EasternKingdoms/Karazhan/karazhan.cpp:23/home/grad/azerothcore-wotlk/src/server/scripts/EasternKingdoms/Karazhan/boss_terestian_illhoof.cpp:
  30. :/home/grad/azerothcore-wotlk/src/server/scripts/EasternKingdoms/Karazhan/karazhan.h16:
  31. :60/home/grad/azerothcore-wotlk/src/server/scripts/EasternKingdoms/Karazhan/karazhan.h::2160:: 21: error: error: missingmissing ',' ',' between between enumerators enumerators
  32.  
  33.     DATA_PRINCE = 30    DATA_PRINCE = 30
  34.  
  35.                     ^                    ^
  36.  
  37.                     ,                     ,
  38.  
  39. In file included from /home/grad/azerothcore-wotlk/src/server/scripts/EasternKingdoms/Karazhan/boss_nightbane.cpp:17:
  40. /home/grad/azerothcore-wotlk/src/server/scripts/EasternKingdoms/Karazhan/karazhan.h:60:21: error: missing ',' between enumerators
  41.     DATA_PRINCE = 30
  42.                     ^
  43.                     ,
  44. In file included from /home/grad/azerothcore-wotlk/src/server/scripts/EasternKingdoms/Karazhan/instance_karazhan.cpp:4:
  45. /home/grad/azerothcore-wotlk/src/server/scripts/EasternKingdoms/Karazhan/karazhan.h:60:21: error: missing ',' between enumerators
  46.     DATA_PRINCE = 30
  47.                     ^
  48.                     ,
  49. In file included from /home/grad/azerothcore-wotlk/src/server/scripts/EasternKingdoms/Karazhan/boss_servant_quarters.cpp:7:
  50. /home/grad/azerothcore-wotlk/src/server/scripts/EasternKingdoms/Karazhan/karazhan.h:60:21:In file included from  /home/grad/azerothcore-wotlk/src/server/scripts/EasternKingdoms/Karazhan/bosses_opera.cpp:17error: :
  51. /home/grad/azerothcore-wotlk/src/server/scripts/EasternKingdoms/Karazhan/karazhan.hmissing:60 ',':21 between:  enumeratorserror
  52. : missing ','     DATA_PRINCE = 30between
  53. enumerators                    ^
  54.  
  55.                     ,
  56.     DATA_PRINCE = 30
  57.                     ^
  58.                     ,
  59. In file included from /home/grad/azerothcore-wotlk/src/server/scripts/EasternKingdoms/Karazhan/boss_moroes.cpp:7:
  60. /home/grad/azerothcore-wotlk/src/server/scripts/EasternKingdoms/Karazhan/karazhan.h:60:21: error: missing ',' between enumerators
  61.     DATA_PRINCE = 30
  62.                     ^
  63.                     ,
  64. In file included from /home/grad/azerothcore-wotlk/src/server/scripts/EasternKingdoms/Karazhan/boss_midnight.cpp:9:
  65. /home/grad/azerothcore-wotlk/src/server/scripts/EasternKingdoms/Karazhan/karazhan.h:60:21: error: missing ',' between enumerators
  66.     DATA_PRINCE = 30
  67.                     ^
  68.                     ,
  69. 1 error generated.
  70. make[2]: *** [src/server/scripts/CMakeFiles/scripts.dir/build.make:3018: src/server/scripts/CMakeFiles/scripts.dir/EasternKingdoms/Karazhan/chess_event.cpp.o] Ошибка 1
  71. make[2]: *** Ожидание завершения заданий…
  72. 1 error generated.
  73. make[2]: *** [src/server/scripts/CMakeFiles/scripts.dir/build.make:2878: src/server/scripts/CMakeFiles/scripts.dir/EasternKingdoms/Karazhan/boss_curator.cpp.o] Ошибка 1
  74. 1 error generated.
  75. make[2]: *** [src/server/scripts/CMakeFiles/scripts.dir/build.make:2990: src/server/scripts/CMakeFiles/scripts.dir/EasternKingdoms/Karazhan/boss_terestian_illhoof.cpp.o] Ошибка 1
  76. 1 error generated.
  77. make[2]: *** [src/server/scripts/CMakeFiles/scripts.dir/build.make:2976: src/server/scripts/CMakeFiles/scripts.dir/EasternKingdoms/Karazhan/boss_moroes.cpp.o] Ошибка 1
  78. 1 error generated.
  79. make[2]: *** [src/server/scripts/CMakeFiles/scripts.dir/build.make:2906: src/server/scripts/CMakeFiles/scripts.dir/EasternKingdoms/Karazhan/boss_netherspite.cpp.o] Ошибка 1
  80. 1 error generated.
  81. make[2]: *** [src/server/scripts/CMakeFiles/scripts.dir/build.make:2850: src/server/scripts/CMakeFiles/scripts.dir/EasternKingdoms/Karazhan/boss_nightbane.cpp.o] Ошибка 1
  82. 1 error generated.
  83. 1 error generated.
  84. 1 error generated.
  85. make[2]: *** [src/server/scripts/CMakeFiles/scripts.dir/build.make:2864: src/server/scripts/CMakeFiles/scripts.dir/EasternKingdoms/Karazhan/karazhan.cpp.o] Ошибка 1
  86. 1 error generated.
  87. 1 error generated.
  88. make[2]: *** [src/server/scripts/CMakeFiles/scripts.dir/build.make:3004: src/server/scripts/CMakeFiles/scripts.dir/EasternKingdoms/Karazhan/boss_servant_quarters.cpp.o] Ошибка 1
  89. make[2]: *** [src/server/scripts/CMakeFiles/scripts.dir/build.make:2892: src/server/scripts/CMakeFiles/scripts.dir/EasternKingdoms/Karazhan/boss_shade_of_aran.cpp.o] Ошибка 1
  90. make[2]: *** [src/server/scripts/CMakeFiles/scripts.dir/build.make:2962: src/server/scripts/CMakeFiles/scripts.dir/EasternKingdoms/Karazhan/bosses_opera.cpp.o] Ошибка 1
  91. make[2]: *** [src/server/scripts/CMakeFiles/scripts.dir/build.make:2948: src/server/scripts/CMakeFiles/scripts.dir/EasternKingdoms/Karazhan/boss_prince_malchezaar.cpp.o] Ошибка 1
  92. 1 error generated.
  93. 1 error generated.
  94. make[2]: *** [src/server/scripts/CMakeFiles/scripts.dir/build.make:2920: src/server/scripts/CMakeFiles/scripts.dir/EasternKingdoms/Karazhan/boss_maiden_of_virtue.cpp.o] Ошибка 1
  95. make[2]: *** [src/server/scripts/CMakeFiles/scripts.dir/build.make:2836: src/server/scripts/CMakeFiles/scripts.dir/EasternKingdoms/Karazhan/instance_karazhan.cpp.o] Ошибка 1
  96. 1 error generated.
  97. make[2]: *** [src/server/scripts/CMakeFiles/scripts.dir/build.make:2934: src/server/scripts/CMakeFiles/scripts.dir/EasternKingdoms/Karazhan/boss_midnight.cpp.o] Ошибка 1
  98. make[1]: *** [CMakeFiles/Makefile2:1192: src/server/scripts/CMakeFiles/scripts.dir/all] Ошибка 2
  99. make: *** [Makefile:130: all] Ошибка 2
  100.  

A PHP Error was encountered

Severity: Core Warning

Message: PHP Startup: Unable to load dynamic library '/usr/lib/php/20170718/mcrypt.so' (tried: /usr/lib/php/20170718/mcrypt.so (/usr/lib/php/20170718/mcrypt.so: cannot open shared object file: No such file or directory), /usr/lib/php/20170718//usr/lib/php/20170718/mcrypt.so.so (/usr/lib/php/20170718//usr/lib/php/20170718/mcrypt.so.so: cannot open shared object file: No such file or directory))

Filename: Unknown

Line Number: 0

Backtrace: