From grad, 7 Months ago, written in Plain Text.
Embed
  1. [ 18%] Building CXX object src/server/shared/CMakeFiles/shared.dir/DataStores/DBCDatabaseLoader.cpp.o
  2. [ 18%] Building CXX object src/server/shared/CMakeFiles/shared.dir/Realm/RealmList.cpp.o
  3. [ 19%] Linking CXX static library libshared.a
  4. [ 19%] Built target shared
  5. [ 19%] Generating CXX prefix source src/server/authserver/cotire/authserver_CXX_prefix.cxx
  6. [ 19%] Generating CXX prefix source src/server/game/cotire/game_CXX_prefix.cxx
  7. [ 19%] Generating CXX prefix source src/server/scripts/cotire/scripts_CXX_prefix.cxx
  8. [ 19%] Generating CXX prefix header src/server/authserver/cotire/authserver_CXX_prefix.hxx
  9. [ 19%] Generating CXX prefix header src/server/game/cotire/game_CXX_prefix.hxx
  10. [ 19%] Generating CXX prefix header src/server/scripts/cotire/scripts_CXX_prefix.hxx
  11. [ 19%] Building CXX precompiled header src/server/authserver/cotire/authserver_CXX_prefix.hxx.gch
  12. [ 19%] Building CXX precompiled header src/server/game/cotire/game_CXX_prefix.hxx.gch
  13. [ 19%] Building CXX precompiled header src/server/scripts/cotire/scripts_CXX_prefix.hxx.gch
  14. In file included from /home/grad/TBC_New/src/server/game/Entities/Item/Item.h:5,
  15.                  from /home/grad/TBC_New/src/server/game/DataStores/DBCStores.h:7,
  16.                  from /home/grad/TBC_New/src/server/game/PrecompiledHeaders/gamePCH.h:10,
  17.                  from /home/grad/TBC_New/build/src/server/game/cotire/game_CXX_prefix.cxx:4,
  18.                  from /home/grad/TBC_New/build/src/server/game/cotire/game_CXX_prefix.hxx:4:
  19. /home/grad/TBC_New/src/server/game/Entities/Object/Object.h: In member function ‘void WorldObject::VisitNearbyGridObject(const float&, NOTIFIER&) const’:
  20. /home/grad/TBC_New/src/server/game/Entities/Object/Object.h:649:137: error: ‘class Map’ has no member named ‘VisitGrid’
  21.   649 |         template<class NOTIFIER> void VisitNearbyGridObject(float const& radius, NOTIFIER& notifier) const { if (IsInWorld()) GetMap()->VisitGrid(GetPositionX(), GetPositionY(), radius, notifier); }
  22.       |                                                                                                                                         ^~~~~~~~~
  23. /home/grad/TBC_New/src/server/game/Entities/Object/Object.h: In member function ‘void WorldObject::VisitNearbyWorldObject(const float&, NOTIFIER&) const’:
  24. /home/grad/TBC_New/src/server/game/Entities/Object/Object.h:650:138: error: ‘class Map’ has no member named ‘VisitWorld’; did you mean ‘VisitAll’?
  25.   650 |         template<class NOTIFIER> void VisitNearbyWorldObject(float const& radius, NOTIFIER& notifier) const { if (IsInWorld()) GetMap()->VisitWorld(GetPositionX(), GetPositionY(), radius, notifier); }
  26.       |                                                                                                                                          ^~~~~~~~~~
  27.       |                                                                                                                                          VisitAll
  28. In file included from /home/grad/TBC_New/src/server/game/Entities/Unit/Unit.h:5,
  29.                  from /home/grad/TBC_New/src/server/game/Entities/Creature/Creature.h:6,
  30.                  from /home/grad/TBC_New/src/server/game/Globals/ObjectMgr.h:5,
  31.                  from /home/grad/TBC_New/src/server/game/Scripting/ScriptMgr.h:12,
  32.                  from /home/grad/TBC_New/src/server/scripts/ScriptPCH.h:9,
  33.                  from /home/grad/TBC_New/build/src/server/scripts/cotire/scripts_CXX_prefix.cxx:4,
  34.                  from /home/grad/TBC_New/build/src/server/scripts/cotire/scripts_CXX_prefix.hxx:4:
  35. /home/grad/TBC_New/src/server/game/Entities/Object/Object.h: In member function ‘void WorldObject::VisitNearbyGridObject(const float&, NOTIFIER&) const’:
  36. /home/grad/TBC_New/src/server/game/Entities/Object/Object.h:649:137: error: ‘class Map’ has no member named ‘VisitGrid’
  37.   649 |         template<class NOTIFIER> void VisitNearbyGridObject(float const& radius, NOTIFIER& notifier) const { if (IsInWorld()) GetMap()->VisitGrid(GetPositionX(), GetPositionY(), radius, notifier); }
  38.       |                                                                                                                                         ^~~~~~~~~
  39. /home/grad/TBC_New/src/server/game/Entities/Object/Object.h: In member function ‘void WorldObject::VisitNearbyWorldObject(const float&, NOTIFIER&) const’:
  40. /home/grad/TBC_New/src/server/game/Entities/Object/Object.h:650:138: error: ‘class Map’ has no member named ‘VisitWorld’; did you mean ‘VisitAll’?
  41.   650 |         template<class NOTIFIER> void VisitNearbyWorldObject(float const& radius, NOTIFIER& notifier) const { if (IsInWorld()) GetMap()->VisitWorld(GetPositionX(), GetPositionY(), radius, notifier); }
  42.       |                                                                                                                                          ^~~~~~~~~~
  43.       |                                                                                                                                          VisitAll
  44. Scanning dependencies of target authserver
  45. [ 20%] Building CXX object src/server/authserver/CMakeFiles/authserver.dir/Authentication/AuthCodes.cpp.o
  46. [ 20%] Building CXX object src/server/authserver/CMakeFiles/authserver.dir/Authentication/TOTP.cpp.o
  47. [ 20%] Building CXX object src/server/authserver/CMakeFiles/authserver.dir/Main.cpp.o
  48. [ 20%] Building CXX object src/server/authserver/CMakeFiles/authserver.dir/Server/AuthSession.cpp.o
  49. cc1plus: warning: /home/grad/TBC_New/build/src/server/authserver/cotire/authserver_CXX_prefix.hxx.gch: not used because `BOOST_ALL_NO_LIB' is defined [-Winvalid-pch]
  50. cc1plus: warning: /home/grad/TBC_New/build/src/server/authserver/cotire/authserver_CXX_prefix.hxx.gch: not used because `BOOST_ALL_NO_LIB' is defined [-Winvalid-pch]
  51. cc1plus: warning: /home/grad/TBC_New/build/src/server/authserver/cotire/authserver_CXX_prefix.hxx.gch: not used because `BOOST_ALL_NO_LIB' is defined [-Winvalid-pch]
  52. cc1plus: warning: /home/grad/TBC_New/build/src/server/authserver/cotire/authserver_CXX_prefix.hxx.gch: not used because `BOOST_ALL_NO_LIB' is defined [-Winvalid-pch]
  53. CMake Error at /home/grad/TBC_New/dep/cotire/CMake/cotire.cmake:1990 (message):
  54.   cotire: error 1 precompiling
  55.   /home/grad/TBC_New/build/src/server/game/cotire/game_CXX_prefix.hxx.
  56. Call Stack (most recent call first):
  57.   /home/grad/TBC_New/dep/cotire/CMake/cotire.cmake:3694 (cotire_precompile_prefix_header)
  58.  
  59.  
  60. make[2]: *** [src/server/game/CMakeFiles/game.dir/build.make:83: src/server/game/cotire/game_CXX_prefix.hxx.gch] Ошибка 1
  61. make[1]: *** [CMakeFiles/Makefile2:1107: src/server/game/CMakeFiles/game.dir/all] Ошибка 2
  62. make[1]: *** Ожидание завершения заданий…
  63. CMake Error at /home/grad/TBC_New/dep/cotire/CMake/cotire.cmake:1990 (message):
  64.   cotire: error 1 precompiling
  65.   /home/grad/TBC_New/build/src/server/scripts/cotire/scripts_CXX_prefix.hxx.
  66. Call Stack (most recent call first):
  67.   /home/grad/TBC_New/dep/cotire/CMake/cotire.cmake:3694 (cotire_precompile_prefix_header)
  68.  
  69.  
  70. make[2]: *** [src/server/scripts/CMakeFiles/scripts.dir/build.make:83: src/server/scripts/cotire/scripts_CXX_prefix.hxx.gch] Ошибка 1
  71. make[1]: *** [CMakeFiles/Makefile2:1166: src/server/scripts/CMakeFiles/scripts.dir/all] Ошибка 2
  72. [ 20%] Linking CXX executable authserver
  73. [ 20%] Built target authserver
  74. make: *** [Makefile:149: all] Ошибка 2
  75.