From grad, 7 Months ago, written in Plain Text.
Embed
  1. [email protected]:~/TBC_New/build$ make -j10
  2. [  1%] Built target gsoap
  3. [  2%] Built target fmt
  4. [  2%] Built target Detour
  5. [  4%] Built target Recast
  6. [  9%] Built target g3dlib
  7. --
  8.     Could not find a proper repository signature (hash) - you may need to pull tags with git fetch -t
  9.     Continuing anyway - note that the versionstring will be set to "unknown 1970-01-01 00:00:00 (Archived)"
  10. [  9%] Built target revision_data.h
  11. [ 14%] Built target common
  12. [ 17%] Built target database
  13. [ 19%] Built target shared
  14. [ 19%] Building CXX precompiled header src/server/game/cotire/game_CXX_prefix.hxx.gch
  15. [ 20%] Building CXX precompiled header src/server/scripts/cotire/scripts_CXX_prefix.hxx.gch
  16. [ 20%] Built target authserver
  17. Scanning dependencies of target scripts
  18. Scanning dependencies of target game
  19. [ 21%] Building CXX object src/server/game/CMakeFiles/game.dir/AuctionHouseHandler.cpp.o
  20. [ 21%] Building CXX object src/server/game/CMakeFiles/game.dir/Channel.cpp.o
  21. [ 21%] Building CXX object src/server/game/CMakeFiles/game.dir/CreatureTextMgr.cpp.o
  22. [ 21%] Building CXX object src/server/game/CMakeFiles/game.dir/DuelHandler.cpp.o
  23. [ 21%] Building CXX object src/server/game/CMakeFiles/game.dir/GridNotifiers.cpp.o
  24. [ 21%] Building CXX object src/server/game/CMakeFiles/game.dir/GlobalEvents.cpp.o
  25. [ 21%] Building CXX object src/server/game/CMakeFiles/game.dir/GridMap.cpp.o
  26. [ 21%] Building CXX object src/server/game/CMakeFiles/game.dir/AuctionHouseMgr.cpp.o
  27. [ 21%] Building CXX object src/server/game/CMakeFiles/game.dir/GameEventMgr.cpp.o
  28. cc1plus: warning: /home/grad/TBC_New/build/src/server/game/cotire/game_CXX_prefix.hxx.gch: not used because `BOOST_ALL_NO_LIB' is defined [-Winvalid-pch]
  29. cc1plus: warning: /home/grad/TBC_New/build/src/server/game/cotire/game_CXX_prefix.hxx.gch: not used because `BOOST_ALL_NO_LIB' is defined [-Winvalid-pch]
  30. cc1plus: warning: /home/grad/TBC_New/build/src/server/game/cotire/game_CXX_prefix.hxx.gch: not used because `BOOST_ALL_NO_LIB' is defined [-Winvalid-pch]
  31. cc1plus: warning: /home/grad/TBC_New/build/src/server/game/cotire/game_CXX_prefix.hxx.gch: not used because `BOOST_ALL_NO_LIB' is defined [-Winvalid-pch]
  32. cc1plus: warning: /home/grad/TBC_New/build/src/server/game/cotire/game_CXX_prefix.hxx.gch: not used because `BOOST_ALL_NO_LIB' is defined [-Winvalid-pch]
  33. cc1plus: warning: /home/grad/TBC_New/build/src/server/game/cotire/game_CXX_prefix.hxx.gch: not used because `BOOST_ALL_NO_LIB' is defined [-Winvalid-pch]
  34. cc1plus: warning: /home/grad/TBC_New/build/src/server/game/cotire/game_CXX_prefix.hxx.gch: not used because `BOOST_ALL_NO_LIB' is defined [-Winvalid-pch]
  35. cc1plus: warning: /home/grad/TBC_New/build/src/server/game/cotire/game_CXX_prefix.hxx.gch: not used because `BOOST_ALL_NO_LIB' is defined [-Winvalid-pch]
  36. cc1plus: warning: /home/grad/TBC_New/build/src/server/game/cotire/game_CXX_prefix.hxx.gch: not used because `BOOST_ALL_NO_LIB' is defined [-Winvalid-pch]
  37. [ 21%] Building CXX object src/server/scripts/CMakeFiles/scripts.dir/gen_scriptloader/static/ScriptLoader.cpp.o
  38. cc1plus: warning: /home/grad/TBC_New/build/src/server/scripts/cotire/scripts_CXX_prefix.hxx.gch: not used because `BOOST_ALL_NO_LIB' is defined [-Winvalid-pch]
  39. [ 21%] Building CXX object src/server/game/CMakeFiles/game.dir/LogsDatabaseAccessor.cpp.o
  40. cc1plus: warning: /home/grad/TBC_New/build/src/server/game/cotire/game_CXX_prefix.hxx.gch: not used because `BOOST_ALL_NO_LIB' is defined [-Winvalid-pch]
  41. [ 21%] Building CXX object src/server/game/CMakeFiles/game.dir/MiscHandler.cpp.o
  42. cc1plus: warning: /home/grad/TBC_New/build/src/server/game/cotire/game_CXX_prefix.hxx.gch: not used because `BOOST_ALL_NO_LIB' is defined [-Winvalid-pch]
  43. [ 21%] Building CXX object src/server/game/CMakeFiles/game.dir/Monitor.cpp.o
  44. cc1plus: warning: /home/grad/TBC_New/build/src/server/game/cotire/game_CXX_prefix.hxx.gch: not used because `BOOST_ALL_NO_LIB' is defined [-Winvalid-pch]
  45. [ 22%] Building CXX object src/server/game/CMakeFiles/game.dir/PlayerDump.cpp.o
  46. cc1plus: warning: /home/grad/TBC_New/build/src/server/game/cotire/game_CXX_prefix.hxx.gch: not used because `BOOST_ALL_NO_LIB' is defined [-Winvalid-pch]
  47. [ 22%] Building CXX object src/server/game/CMakeFiles/game.dir/PlayerTaxi.cpp.o
  48. cc1plus: warning: /home/grad/TBC_New/build/src/server/game/cotire/game_CXX_prefix.hxx.gch: not used because `BOOST_ALL_NO_LIB' is defined [-Winvalid-pch]
  49. [ 22%] Building CXX object src/server/scripts/CMakeFiles/scripts.dir/Battlegrounds/battlegrounds_script_loader.cpp.o
  50. cc1plus: warning: /home/grad/TBC_New/build/src/server/scripts/cotire/scripts_CXX_prefix.hxx.gch: not used because `BOOST_ALL_NO_LIB' is defined [-Winvalid-pch]
  51. [ 22%] Building CXX object src/server/game/CMakeFiles/game.dir/Profiler.cpp.o
  52. cc1plus: warning: /home/grad/TBC_New/build/src/server/game/cotire/game_CXX_prefix.hxx.gch: not used because `BOOST_ALL_NO_LIB' is defined [-Winvalid-pch]
  53. [ 22%] Building CXX object src/server/scripts/CMakeFiles/scripts.dir/Battlegrounds/alterac_valley/alterac_bowman.cpp.o
  54. cc1plus: warning: /home/grad/TBC_New/build/src/server/scripts/cotire/scripts_CXX_prefix.hxx.gch: not used because `BOOST_ALL_NO_LIB' is defined [-Winvalid-pch]
  55. [ 22%] Building CXX object src/server/game/CMakeFiles/game.dir/QuestDef.cpp.o
  56. cc1plus: warning: /home/grad/TBC_New/build/src/server/game/cotire/game_CXX_prefix.hxx.gch: not used because `BOOST_ALL_NO_LIB' is defined [-Winvalid-pch]
  57. [ 22%] Building CXX object src/server/game/CMakeFiles/game.dir/RecupMgr.cpp.o
  58. cc1plus: warning: /home/grad/TBC_New/build/src/server/game/cotire/game_CXX_prefix.hxx.gch: not used because `BOOST_ALL_NO_LIB' is defined [-Winvalid-pch]
  59. [ 22%] Building CXX object src/server/game/CMakeFiles/game.dir/SkillDiscovery.cpp.o
  60. cc1plus: warning: /home/grad/TBC_New/build/src/server/game/cotire/game_CXX_prefix.hxx.gch: not used because `BOOST_ALL_NO_LIB' is defined [-Winvalid-pch]
  61. [ 22%] Building CXX object src/server/game/CMakeFiles/game.dir/SkillExtraItems.cpp.o
  62. cc1plus: warning: /home/grad/TBC_New/build/src/server/game/cotire/game_CXX_prefix.hxx.gch: not used because `BOOST_ALL_NO_LIB' is defined [-Winvalid-pch]
  63. [ 22%] Building CXX object src/server/scripts/CMakeFiles/scripts.dir/Battlegrounds/alterac_valley/alterac_valley.cpp.o
  64. cc1plus: warning: /home/grad/TBC_New/build/src/server/scripts/cotire/scripts_CXX_prefix.hxx.gch: not used because `BOOST_ALL_NO_LIB' is defined [-Winvalid-pch]
  65. [ 22%] Building CXX object src/server/scripts/CMakeFiles/scripts.dir/Battlegrounds/alterac_valley/boss_balinda.cpp.o
  66. cc1plus: warning: /home/grad/TBC_New/build/src/server/scripts/cotire/scripts_CXX_prefix.hxx.gch: not used because `BOOST_ALL_NO_LIB' is defined [-Winvalid-pch]
  67. [ 23%] Building CXX object src/server/scripts/CMakeFiles/scripts.dir/Battlegrounds/alterac_valley/boss_drekthar.cpp.o
  68. cc1plus: warning: /home/grad/TBC_New/build/src/server/scripts/cotire/scripts_CXX_prefix.hxx.gch: not used because `BOOST_ALL_NO_LIB' is defined [-Winvalid-pch]
  69. [ 23%] Building CXX object src/server/scripts/CMakeFiles/scripts.dir/Battlegrounds/alterac_valley/boss_galvangar.cpp.o
  70. cc1plus: warning: /home/grad/TBC_New/build/src/server/scripts/cotire/scripts_CXX_prefix.hxx.gch: not used because `BOOST_ALL_NO_LIB' is defined [-Winvalid-pch]
  71. [ 23%] Building CXX object src/server/game/CMakeFiles/game.dir/SocialHandler.cpp.o
  72. cc1plus: warning: /home/grad/TBC_New/build/src/server/game/cotire/game_CXX_prefix.hxx.gch: not used because `BOOST_ALL_NO_LIB' is defined [-Winvalid-pch]
  73. [ 24%] Building CXX object src/server/game/CMakeFiles/game.dir/SpectatorAddon.cpp.o
  74. cc1plus: warning: /home/grad/TBC_New/build/src/server/game/cotire/game_CXX_prefix.hxx.gch: not used because `BOOST_ALL_NO_LIB' is defined [-Winvalid-pch]
  75. [ 24%] Building CXX object src/server/scripts/CMakeFiles/scripts.dir/Battlegrounds/alterac_valley/boss_vanndar.cpp.o
  76. cc1plus: warning: /home/grad/TBC_New/build/src/server/scripts/cotire/scripts_CXX_prefix.hxx.gch: not used because `BOOST_ALL_NO_LIB' is defined [-Winvalid-pch]
  77. [ 24%] Building CXX object src/server/game/CMakeFiles/game.dir/TaxiHandler.cpp.o
  78. cc1plus: warning: /home/grad/TBC_New/build/src/server/game/cotire/game_CXX_prefix.hxx.gch: not used because `BOOST_ALL_NO_LIB' is defined [-Winvalid-pch]
  79. [ 24%] Building CXX object src/server/scripts/CMakeFiles/scripts.dir/Commands/cs_account.cpp.o
  80. cc1plus: warning: /home/grad/TBC_New/build/src/server/scripts/cotire/scripts_CXX_prefix.hxx.gch: not used because `BOOST_ALL_NO_LIB' is defined [-Winvalid-pch]
  81. [ 24%] Building CXX object src/server/scripts/CMakeFiles/scripts.dir/Commands/cs_ban.cpp.o
  82. cc1plus: warning: /home/grad/TBC_New/build/src/server/scripts/cotire/scripts_CXX_prefix.hxx.gch: not used because `BOOST_ALL_NO_LIB' is defined [-Winvalid-pch]
  83. [ 24%] Building CXX object src/server/scripts/CMakeFiles/scripts.dir/Commands/cs_cast.cpp.o
  84. cc1plus: warning: /home/grad/TBC_New/build/src/server/scripts/cotire/scripts_CXX_prefix.hxx.gch: not used because `BOOST_ALL_NO_LIB' is defined [-Winvalid-pch]
  85. [ 24%] Building CXX object src/server/scripts/CMakeFiles/scripts.dir/Commands/cs_cheat.cpp.o
  86. cc1plus: warning: /home/grad/TBC_New/build/src/server/scripts/cotire/scripts_CXX_prefix.hxx.gch: not used because `BOOST_ALL_NO_LIB' is defined [-Winvalid-pch]
  87. [ 24%] Building CXX object src/server/scripts/CMakeFiles/scripts.dir/Commands/cs_debug.cpp.o
  88. cc1plus: warning: /home/grad/TBC_New/build/src/server/scripts/cotire/scripts_CXX_prefix.hxx.gch: not used because `BOOST_ALL_NO_LIB' is defined [-Winvalid-pch]
  89. [ 24%] Building CXX object src/server/game/CMakeFiles/game.dir/Weather.cpp.o
  90. cc1plus: warning: /home/grad/TBC_New/build/src/server/game/cotire/game_CXX_prefix.hxx.gch: not used because `BOOST_ALL_NO_LIB' is defined [-Winvalid-pch]
  91. [ 25%] Building CXX object src/server/scripts/CMakeFiles/scripts.dir/Commands/cs_event.cpp.o
  92. cc1plus: warning: /home/grad/TBC_New/build/src/server/scripts/cotire/scripts_CXX_prefix.hxx.gch: not used because `BOOST_ALL_NO_LIB' is defined [-Winvalid-pch]
  93. [ 25%] Building CXX object src/server/game/CMakeFiles/game.dir/World.cpp.o
  94. [ 25%] Building CXX object src/server/game/CMakeFiles/game.dir/AI/AOEAI.cpp.o
  95. cc1plus: warning: /home/grad/TBC_New/build/src/server/game/cotire/game_CXX_prefix.hxx.gch: not used because `BOOST_ALL_NO_LIB' is defined [-Winvalid-pch]
  96. cc1plus: warning: /home/grad/TBC_New/build/src/server/game/cotire/game_CXX_prefix.hxx.gch: not used because `BOOST_ALL_NO_LIB' is defined [-Winvalid-pch]
  97. [ 25%] Building CXX object src/server/game/CMakeFiles/game.dir/AI/ArcherAI.cpp.o
  98. cc1plus: warning: /home/grad/TBC_New/build/src/server/game/cotire/game_CXX_prefix.hxx.gch: not used because `BOOST_ALL_NO_LIB' is defined [-Winvalid-pch]
  99. [ 25%] Building CXX object src/server/game/CMakeFiles/game.dir/AI/CombatAI.cpp.o
  100. cc1plus: warning: /home/grad/TBC_New/build/src/server/game/cotire/game_CXX_prefix.hxx.gch: not used because `BOOST_ALL_NO_LIB' is defined [-Winvalid-pch]
  101. [ 25%] Building CXX object src/server/scripts/CMakeFiles/scripts.dir/Commands/cs_gm.cpp.o
  102. cc1plus: warning: /home/grad/TBC_New/build/src/server/scripts/cotire/scripts_CXX_prefix.hxx.gch: not used because `BOOST_ALL_NO_LIB' is defined [-Winvalid-pch]
  103. [ 25%] Building CXX object src/server/game/CMakeFiles/game.dir/AI/CreatureAI.cpp.o
  104. cc1plus: warning: /home/grad/TBC_New/build/src/server/game/cotire/game_CXX_prefix.hxx.gch: not used because `BOOST_ALL_NO_LIB' is defined [-Winvalid-pch]
  105. [ 25%] Building CXX object src/server/scripts/CMakeFiles/scripts.dir/Commands/cs_go.cpp.o
  106. cc1plus: warning: /home/grad/TBC_New/build/src/server/scripts/cotire/scripts_CXX_prefix.hxx.gch: not used because `BOOST_ALL_NO_LIB' is defined [-Winvalid-pch]
  107. [ 25%] Building CXX object src/server/scripts/CMakeFiles/scripts.dir/Commands/cs_gobject.cpp.o
  108. cc1plus: warning: /home/grad/TBC_New/build/src/server/scripts/cotire/scripts_CXX_prefix.hxx.gch: not used because `BOOST_ALL_NO_LIB' is defined [-Winvalid-pch]
  109. [ 25%] Building CXX object src/server/game/CMakeFiles/game.dir/AI/CreatureAIRegistry.cpp.o
  110. cc1plus: warning: /home/grad/TBC_New/build/src/server/game/cotire/game_CXX_prefix.hxx.gch: not used because `BOOST_ALL_NO_LIB' is defined [-Winvalid-pch]
  111. [ 25%] Building CXX object src/server/scripts/CMakeFiles/scripts.dir/Commands/cs_group.cpp.o
  112. cc1plus: warning: /home/grad/TBC_New/build/src/server/scripts/cotire/scripts_CXX_prefix.hxx.gch: not used because `BOOST_ALL_NO_LIB' is defined [-Winvalid-pch]
  113. [ 25%] Building CXX object src/server/scripts/CMakeFiles/scripts.dir/Commands/cs_guild.cpp.o
  114. cc1plus: warning: /home/grad/TBC_New/build/src/server/scripts/cotire/scripts_CXX_prefix.hxx.gch: not used because `BOOST_ALL_NO_LIB' is defined [-Winvalid-pch]
  115. [ 26%] Building CXX object src/server/game/CMakeFiles/game.dir/AI/CreatureAISelector.cpp.o
  116. cc1plus: warning: /home/grad/TBC_New/build/src/server/game/cotire/game_CXX_prefix.hxx.gch: not used because `BOOST_ALL_NO_LIB' is defined [-Winvalid-pch]
  117. [ 26%] Building CXX object src/server/game/CMakeFiles/game.dir/AI/EscortAI.cpp.o
  118. cc1plus: warning: /home/grad/TBC_New/build/src/server/game/cotire/game_CXX_prefix.hxx.gch: not used because `BOOST_ALL_NO_LIB' is defined [-Winvalid-pch]
  119. [ 26%] Building CXX object src/server/scripts/CMakeFiles/scripts.dir/Commands/cs_honor.cpp.o
  120. cc1plus: warning: /home/grad/TBC_New/build/src/server/scripts/cotire/scripts_CXX_prefix.hxx.gch: not used because `BOOST_ALL_NO_LIB' is defined [-Winvalid-pch]
  121. [ 26%] Building CXX object src/server/game/CMakeFiles/game.dir/AI/FollowerAI.cpp.o
  122. cc1plus: warning: /home/grad/TBC_New/build/src/server/game/cotire/game_CXX_prefix.hxx.gch: not used because `BOOST_ALL_NO_LIB' is defined [-Winvalid-pch]
  123. [ 26%] Building CXX object src/server/game/CMakeFiles/game.dir/AI/GameObjectAI.cpp.o
  124. cc1plus: warning: /home/grad/TBC_New/build/src/server/game/cotire/game_CXX_prefix.hxx.gch: not used because `BOOST_ALL_NO_LIB' is defined [-Winvalid-pch]
  125. [ 26%] Building CXX object src/server/scripts/CMakeFiles/scripts.dir/Commands/cs_instance.cpp.o
  126. cc1plus: warning: /home/grad/TBC_New/build/src/server/scripts/cotire/scripts_CXX_prefix.hxx.gch: not used because `BOOST_ALL_NO_LIB' is defined [-Winvalid-pch]
  127. [ 26%] Building CXX object src/server/scripts/CMakeFiles/scripts.dir/Commands/cs_learn.cpp.o
  128. cc1plus: warning: /home/grad/TBC_New/build/src/server/scripts/cotire/scripts_CXX_prefix.hxx.gch: not used because `BOOST_ALL_NO_LIB' is defined [-Winvalid-pch]
  129. [ 27%] Building CXX object src/server/scripts/CMakeFiles/scripts.dir/Commands/cs_list.cpp.o
  130. cc1plus: warning: /home/grad/TBC_New/build/src/server/scripts/cotire/scripts_CXX_prefix.hxx.gch: not used because `BOOST_ALL_NO_LIB' is defined [-Winvalid-pch]
  131. [ 27%] Building CXX object src/server/game/CMakeFiles/game.dir/AI/GuardAI.cpp.o
  132. cc1plus: warning: /home/grad/TBC_New/build/src/server/game/cotire/game_CXX_prefix.hxx.gch: not used because `BOOST_ALL_NO_LIB' is defined [-Winvalid-pch]
  133. [ 27%] Building CXX object src/server/scripts/CMakeFiles/scripts.dir/Commands/cs_lookup.cpp.o
  134. cc1plus: warning: /home/grad/TBC_New/build/src/server/scripts/cotire/scripts_CXX_prefix.hxx.gch: not used because `BOOST_ALL_NO_LIB' is defined [-Winvalid-pch]
  135. [ 27%] Building CXX object src/server/scripts/CMakeFiles/scripts.dir/Commands/cs_misc.cpp.o
  136. cc1plus: warning: /home/grad/TBC_New/build/src/server/scripts/cotire/scripts_CXX_prefix.hxx.gch: not used because `BOOST_ALL_NO_LIB' is defined [-Winvalid-pch]
  137. [ 27%] Building CXX object src/server/game/CMakeFiles/game.dir/AI/NullCreatureAI.cpp.o
  138. cc1plus: warning: /home/grad/TBC_New/build/src/server/game/cotire/game_CXX_prefix.hxx.gch: not used because `BOOST_ALL_NO_LIB' is defined [-Winvalid-pch]
  139. [ 27%] Building CXX object src/server/scripts/CMakeFiles/scripts.dir/Commands/cs_misc2.cpp.o
  140. cc1plus: warning: /home/grad/TBC_New/build/src/server/scripts/cotire/scripts_CXX_prefix.hxx.gch: not used because `BOOST_ALL_NO_LIB' is defined [-Winvalid-pch]
  141. [ 27%] Building CXX object src/server/scripts/CMakeFiles/scripts.dir/Commands/cs_mmap.cpp.o
  142. cc1plus: warning: /home/grad/TBC_New/build/src/server/scripts/cotire/scripts_CXX_prefix.hxx.gch: not used because `BOOST_ALL_NO_LIB' is defined [-Winvalid-pch]
  143. [ 27%] Building CXX object src/server/game/CMakeFiles/game.dir/AI/PetAI.cpp.o
  144. cc1plus: warning: /home/grad/TBC_New/build/src/server/game/cotire/game_CXX_prefix.hxx.gch: not used because `BOOST_ALL_NO_LIB' is defined [-Winvalid-pch]
  145. [ 27%] Building CXX object src/server/scripts/CMakeFiles/scripts.dir/Commands/cs_modify.cpp.o
  146. cc1plus: warning: /home/grad/TBC_New/build/src/server/scripts/cotire/scripts_CXX_prefix.hxx.gch: not used because `BOOST_ALL_NO_LIB' is defined [-Winvalid-pch]
  147. [ 27%] Building CXX object src/server/game/CMakeFiles/game.dir/AI/PlayerAI.cpp.o
  148. cc1plus: warning: /home/grad/TBC_New/build/src/server/game/cotire/game_CXX_prefix.hxx.gch: not used because `BOOST_ALL_NO_LIB' is defined [-Winvalid-pch]
  149. [ 27%] Building CXX object src/server/scripts/CMakeFiles/scripts.dir/Commands/cs_muteinfo.cpp.o
  150. cc1plus: warning: /home/grad/TBC_New/build/src/server/scripts/cotire/scripts_CXX_prefix.hxx.gch: not used because `BOOST_ALL_NO_LIB' is defined [-Winvalid-pch]
  151. [ 27%] Building CXX object src/server/scripts/CMakeFiles/scripts.dir/Commands/cs_npc.cpp.o
  152. cc1plus: warning: /home/grad/TBC_New/build/src/server/scripts/cotire/scripts_CXX_prefix.hxx.gch: not used because `BOOST_ALL_NO_LIB' is defined [-Winvalid-pch]
  153. [ 28%] Building CXX object src/server/game/CMakeFiles/game.dir/AI/ReactorAI.cpp.o
  154. cc1plus: warning: /home/grad/TBC_New/build/src/server/game/cotire/game_CXX_prefix.hxx.gch: not used because `BOOST_ALL_NO_LIB' is defined [-Winvalid-pch]
  155. [ 28%] Building CXX object src/server/game/CMakeFiles/game.dir/AI/ScriptedCreature.cpp.o
  156. cc1plus: warning: /home/grad/TBC_New/build/src/server/game/cotire/game_CXX_prefix.hxx.gch: not used because `BOOST_ALL_NO_LIB' is defined [-Winvalid-pch]
  157. [ 28%] Building CXX object src/server/game/CMakeFiles/game.dir/AI/ScriptedGossip.cpp.o
  158. cc1plus: warning: /home/grad/TBC_New/build/src/server/game/cotire/game_CXX_prefix.hxx.gch: not used because `BOOST_ALL_NO_LIB' is defined [-Winvalid-pch]
  159. [ 29%] Building CXX object src/server/scripts/CMakeFiles/scripts.dir/Commands/cs_pdump.cpp.o
  160. cc1plus: warning: /home/grad/TBC_New/build/src/server/scripts/cotire/scripts_CXX_prefix.hxx.gch: not used because `BOOST_ALL_NO_LIB' is defined [-Winvalid-pch]
  161. [ 29%] Building CXX object src/server/scripts/CMakeFiles/scripts.dir/Commands/cs_pet.cpp.o
  162. cc1plus: warning: /home/grad/TBC_New/build/src/server/scripts/cotire/scripts_CXX_prefix.hxx.gch: not used because `BOOST_ALL_NO_LIB' is defined [-Winvalid-pch]
  163. [ 29%] Building CXX object src/server/scripts/CMakeFiles/scripts.dir/Commands/cs_profiling.cpp.o
  164. cc1plus: warning: /home/grad/TBC_New/build/src/server/scripts/cotire/scripts_CXX_prefix.hxx.gch: not used because `BOOST_ALL_NO_LIB' is defined [-Winvalid-pch]
  165. [ 29%] Building CXX object src/server/game/CMakeFiles/game.dir/AI/SimpleAI.cpp.o
  166. cc1plus: warning: /home/grad/TBC_New/build/src/server/game/cotire/game_CXX_prefix.hxx.gch: not used because `BOOST_ALL_NO_LIB' is defined [-Winvalid-pch]
  167. [ 29%] Building CXX object src/server/game/CMakeFiles/game.dir/AI/SimpleCooldown.cpp.o
  168. cc1plus: warning: /home/grad/TBC_New/build/src/server/game/cotire/game_CXX_prefix.hxx.gch: not used because `BOOST_ALL_NO_LIB' is defined [-Winvalid-pch]
  169. [ 29%] Building CXX object src/server/game/CMakeFiles/game.dir/AI/SmartAI.cpp.o
  170. cc1plus: warning: /home/grad/TBC_New/build/src/server/game/cotire/game_CXX_prefix.hxx.gch: not used because `BOOST_ALL_NO_LIB' is defined [-Winvalid-pch]
  171. [ 29%] Building CXX object src/server/game/CMakeFiles/game.dir/AI/SmartScript.cpp.o
  172. cc1plus: warning: /home/grad/TBC_New/build/src/server/game/cotire/game_CXX_prefix.hxx.gch: not used because `BOOST_ALL_NO_LIB' is defined [-Winvalid-pch]
  173. [ 29%] Building CXX object src/server/game/CMakeFiles/game.dir/AI/SmartScriptMgr.cpp.o
  174. cc1plus: warning: /home/grad/TBC_New/build/src/server/game/cotire/game_CXX_prefix.hxx.gch: not used because `BOOST_ALL_NO_LIB' is defined [-Winvalid-pch]
  175. [ 29%] Building CXX object src/server/game/CMakeFiles/game.dir/AI/TotemAI.cpp.o
  176. cc1plus: warning: /home/grad/TBC_New/build/src/server/game/cotire/game_CXX_prefix.hxx.gch: not used because `BOOST_ALL_NO_LIB' is defined [-Winvalid-pch]
  177. [ 30%] Building CXX object src/server/game/CMakeFiles/game.dir/AI/UnitAI.cpp.o
  178. cc1plus: warning: /home/grad/TBC_New/build/src/server/game/cotire/game_CXX_prefix.hxx.gch: not used because `BOOST_ALL_NO_LIB' is defined [-Winvalid-pch]
  179. [ 30%] Building CXX object src/server/scripts/CMakeFiles/scripts.dir/Commands/cs_quest.cpp.o
  180. cc1plus: warning: /home/grad/TBC_New/build/src/server/scripts/cotire/scripts_CXX_prefix.hxx.gch: not used because `BOOST_ALL_NO_LIB' is defined [-Winvalid-pch]
  181. [ 30%] Building CXX object src/server/scripts/CMakeFiles/scripts.dir/Commands/cs_reload.cpp.o
  182. cc1plus: warning: /home/grad/TBC_New/build/src/server/scripts/cotire/scripts_CXX_prefix.hxx.gch: not used because `BOOST_ALL_NO_LIB' is defined [-Winvalid-pch]
  183. [ 30%] Building CXX object src/server/scripts/CMakeFiles/scripts.dir/Commands/cs_replay.cpp.o
  184. cc1plus: warning: /home/grad/TBC_New/build/src/server/scripts/cotire/scripts_CXX_prefix.hxx.gch: not used because `BOOST_ALL_NO_LIB' is defined [-Winvalid-pch]
  185. [ 30%] Building CXX object src/server/game/CMakeFiles/game.dir/Accounts/AccountMgr.cpp.o
  186. cc1plus: warning: /home/grad/TBC_New/build/src/server/game/cotire/game_CXX_prefix.hxx.gch: not used because `BOOST_ALL_NO_LIB' is defined [-Winvalid-pch]
  187. [ 30%] Building CXX object src/server/scripts/CMakeFiles/scripts.dir/Commands/cs_reset.cpp.o
  188. cc1plus: warning: /home/grad/TBC_New/build/src/server/scripts/cotire/scripts_CXX_prefix.hxx.gch: not used because `BOOST_ALL_NO_LIB' is defined [-Winvalid-pch]
  189. [ 30%] Building CXX object src/server/game/CMakeFiles/game.dir/Accounts/RBAC.cpp.o
  190. cc1plus: warning: /home/grad/TBC_New/build/src/server/game/cotire/game_CXX_prefix.hxx.gch: not used because `BOOST_ALL_NO_LIB' is defined [-Winvalid-pch]
  191. [ 30%] Building CXX object src/server/game/CMakeFiles/game.dir/Addons/AddonMgr.cpp.o
  192. cc1plus: warning: /home/grad/TBC_New/build/src/server/game/cotire/game_CXX_prefix.hxx.gch: not used because `BOOST_ALL_NO_LIB' is defined [-Winvalid-pch]
  193. [ 30%] Building CXX object src/server/scripts/CMakeFiles/scripts.dir/Commands/cs_script_loader.cpp.o
  194. cc1plus: warning: /home/grad/TBC_New/build/src/server/scripts/cotire/scripts_CXX_prefix.hxx.gch: not used because `BOOST_ALL_NO_LIB' is defined [-Winvalid-pch]
  195. [ 30%] Building CXX object src/server/game/CMakeFiles/game.dir/Anticheat/PlayerAntiCheat.cpp.o
  196. cc1plus: warning: /home/grad/TBC_New/build/src/server/game/cotire/game_CXX_prefix.hxx.gch: not used because `BOOST_ALL_NO_LIB' is defined [-Winvalid-pch]
  197. [ 31%] Building CXX object src/server/scripts/CMakeFiles/scripts.dir/Commands/cs_send.cpp.o
  198. cc1plus: warning: /home/grad/TBC_New/build/src/server/scripts/cotire/scripts_CXX_prefix.hxx.gch: not used because `BOOST_ALL_NO_LIB' is defined [-Winvalid-pch]
  199. [ 31%] Building CXX object src/server/scripts/CMakeFiles/scripts.dir/Commands/cs_server.cpp.o
  200. cc1plus: warning: /home/grad/TBC_New/build/src/server/scripts/cotire/scripts_CXX_prefix.hxx.gch: not used because `BOOST_ALL_NO_LIB' is defined [-Winvalid-pch]
  201. [ 31%] Building CXX object src/server/game/CMakeFiles/game.dir/Battlegrounds/ArenaTeam.cpp.o
  202. cc1plus: warning: /home/grad/TBC_New/build/src/server/game/cotire/game_CXX_prefix.hxx.gch: not used because `BOOST_ALL_NO_LIB' is defined [-Winvalid-pch]
  203. [ 31%] Building CXX object src/server/game/CMakeFiles/game.dir/Battlegrounds/ArenaTeamHandler.cpp.o
  204. cc1plus: warning: /home/grad/TBC_New/build/src/server/game/cotire/game_CXX_prefix.hxx.gch: not used because `BOOST_ALL_NO_LIB' is defined [-Winvalid-pch]
  205. [ 31%] Building CXX object src/server/scripts/CMakeFiles/scripts.dir/Commands/cs_shop.cpp.o
  206. cc1plus: warning: /home/grad/TBC_New/build/src/server/scripts/cotire/scripts_CXX_prefix.hxx.gch: not used because `BOOST_ALL_NO_LIB' is defined [-Winvalid-pch]
  207. [ 31%] Building CXX object src/server/scripts/CMakeFiles/scripts.dir/Commands/cs_smartai.cpp.o
  208. cc1plus: warning: /home/grad/TBC_New/build/src/server/scripts/cotire/scripts_CXX_prefix.hxx.gch: not used because `BOOST_ALL_NO_LIB' is defined [-Winvalid-pch]
  209. [ 31%] Building CXX object src/server/game/CMakeFiles/game.dir/Battlegrounds/ArenaTeamMgr.cpp.o
  210. cc1plus: warning: /home/grad/TBC_New/build/src/server/game/cotire/game_CXX_prefix.hxx.gch: not used because `BOOST_ALL_NO_LIB' is defined [-Winvalid-pch]
  211. [ 31%] Building CXX object src/server/scripts/CMakeFiles/scripts.dir/Commands/cs_spectate.cpp.o
  212. cc1plus: warning: /home/grad/TBC_New/build/src/server/scripts/cotire/scripts_CXX_prefix.hxx.gch: not used because `BOOST_ALL_NO_LIB' is defined [-Winvalid-pch]
  213. [ 31%] Building CXX object src/server/scripts/CMakeFiles/scripts.dir/Commands/cs_tele.cpp.o
  214. cc1plus: warning: /home/grad/TBC_New/build/src/server/scripts/cotire/scripts_CXX_prefix.hxx.gch: not used because `BOOST_ALL_NO_LIB' is defined [-Winvalid-pch]
  215. [ 31%] Building CXX object src/server/scripts/CMakeFiles/scripts.dir/Commands/cs_test.cpp.o
  216. cc1plus: warning: /home/grad/TBC_New/build/src/server/scripts/cotire/scripts_CXX_prefix.hxx.gch: not used because `BOOST_ALL_NO_LIB' is defined [-Winvalid-pch]
  217. [ 32%] Building CXX object src/server/game/CMakeFiles/game.dir/Battlegrounds/BattleGround.cpp.o
  218. cc1plus: warning: /home/grad/TBC_New/build/src/server/game/cotire/game_CXX_prefix.hxx.gch: not used because `BOOST_ALL_NO_LIB' is defined [-Winvalid-pch]
  219. [ 32%] Building CXX object src/server/game/CMakeFiles/game.dir/Battlegrounds/BattleGroundHandler.cpp.o
  220. cc1plus: warning: /home/grad/TBC_New/build/src/server/game/cotire/game_CXX_prefix.hxx.gch: not used because `BOOST_ALL_NO_LIB' is defined [-Winvalid-pch]
  221. [ 32%] Building CXX object src/server/scripts/CMakeFiles/scripts.dir/Commands/cs_ticket.cpp.o
  222. cc1plus: warning: /home/grad/TBC_New/build/src/server/scripts/cotire/scripts_CXX_prefix.hxx.gch: not used because `BOOST_ALL_NO_LIB' is defined [-Winvalid-pch]
  223. [ 32%] Building CXX object src/server/game/CMakeFiles/game.dir/Battlegrounds/BattleGroundMgr.cpp.o
  224. cc1plus: warning: /home/grad/TBC_New/build/src/server/game/cotire/game_CXX_prefix.hxx.gch: not used because `BOOST_ALL_NO_LIB' is defined [-Winvalid-pch]
  225. [ 32%] Building CXX object src/server/game/CMakeFiles/game.dir/Battlegrounds/BattleGroundQueue.cpp.o
  226. cc1plus: warning: /home/grad/TBC_New/build/src/server/game/cotire/game_CXX_prefix.hxx.gch: not used because `BOOST_ALL_NO_LIB' is defined [-Winvalid-pch]
  227. [ 32%] Building CXX object src/server/scripts/CMakeFiles/scripts.dir/Commands/cs_wp.cpp.o
  228. cc1plus: warning: /home/grad/TBC_New/build/src/server/scripts/cotire/scripts_CXX_prefix.hxx.gch: not used because `BOOST_ALL_NO_LIB' is defined [-Winvalid-pch]
  229. [ 32%] Building CXX object src/server/game/CMakeFiles/game.dir/Battlegrounds/Zones/BattleGroundAA.cpp.o
  230. cc1plus: warning: /home/grad/TBC_New/build/src/server/game/cotire/game_CXX_prefix.hxx.gch: not used because `BOOST_ALL_NO_LIB' is defined [-Winvalid-pch]
  231. [ 33%] Building CXX object src/server/scripts/CMakeFiles/scripts.dir/Commands/cs_zone.cpp.o
  232. cc1plus: warning: /home/grad/TBC_New/build/src/server/scripts/cotire/scripts_CXX_prefix.hxx.gch: not used because `BOOST_ALL_NO_LIB' is defined [-Winvalid-pch]
  233. [ 33%] Building CXX object src/server/game/CMakeFiles/game.dir/Battlegrounds/Zones/BattleGroundAB.cpp.o
  234. cc1plus: warning: /home/grad/TBC_New/build/src/server/game/cotire/game_CXX_prefix.hxx.gch: not used because `BOOST_ALL_NO_LIB' is defined [-Winvalid-pch]
  235. [ 33%] Building CXX object src/server/scripts/CMakeFiles/scripts.dir/EasternKingdoms/eastern_kingdoms_script_loader.cpp.o
  236. cc1plus: warning: /home/grad/TBC_New/build/src/server/scripts/cotire/scripts_CXX_prefix.hxx.gch: not used because `BOOST_ALL_NO_LIB' is defined [-Winvalid-pch]
  237. [ 33%] Building CXX object src/server/game/CMakeFiles/game.dir/Battlegrounds/Zones/BattleGroundAV.cpp.o
  238. [ 33%] Building CXX object src/server/game/CMakeFiles/game.dir/Battlegrounds/Zones/BattleGroundBE.cpp.o
  239. cc1plus: warning: /home/grad/TBC_New/build/src/server/game/cotire/game_CXX_prefix.hxx.gch: not used because `BOOST_ALL_NO_LIB' is defined [-Winvalid-pch]
  240. cc1plus: warning: /home/grad/TBC_New/build/src/server/game/cotire/game_CXX_prefix.hxx.gch: not used because `BOOST_ALL_NO_LIB' is defined [-Winvalid-pch]
  241. [ 33%] Building CXX object src/server/scripts/CMakeFiles/scripts.dir/EasternKingdoms/zone_alterac_mountains.cpp.o
  242. cc1plus: warning: /home/grad/TBC_New/build/src/server/scripts/cotire/scripts_CXX_prefix.hxx.gch: not used because `BOOST_ALL_NO_LIB' is defined [-Winvalid-pch]
  243. [ 34%] Building CXX object src/server/game/CMakeFiles/game.dir/Battlegrounds/Zones/BattleGroundEY.cpp.o
  244. cc1plus: warning: /home/grad/TBC_New/build/src/server/game/cotire/game_CXX_prefix.hxx.gch: not used because `BOOST_ALL_NO_LIB' is defined [-Winvalid-pch]
  245. [ 34%] Building CXX object src/server/game/CMakeFiles/game.dir/Battlegrounds/Zones/BattleGroundNA.cpp.o
  246. cc1plus: warning: /home/grad/TBC_New/build/src/server/game/cotire/game_CXX_prefix.hxx.gch: not used because `BOOST_ALL_NO_LIB' is defined [-Winvalid-pch]
  247. [ 34%] Building CXX object src/server/game/CMakeFiles/game.dir/Battlegrounds/Zones/BattleGroundRL.cpp.o
  248. cc1plus: warning: /home/grad/TBC_New/build/src/server/game/cotire/game_CXX_prefix.hxx.gch: not used because `BOOST_ALL_NO_LIB' is defined [-Winvalid-pch]
  249. [ 34%] Building CXX object src/server/game/CMakeFiles/game.dir/Battlegrounds/Zones/BattleGroundWS.cpp.o
  250. cc1plus: warning: /home/grad/TBC_New/build/src/server/game/cotire/game_CXX_prefix.hxx.gch: not used because `BOOST_ALL_NO_LIB' is defined [-Winvalid-pch]
  251. [ 34%] Building CXX object src/server/scripts/CMakeFiles/scripts.dir/EasternKingdoms/zone_arathi_highlands.cpp.o
  252. cc1plus: warning: /home/grad/TBC_New/build/src/server/scripts/cotire/scripts_CXX_prefix.hxx.gch: not used because `BOOST_ALL_NO_LIB' is defined [-Winvalid-pch]
  253. [ 34%] Building CXX object src/server/scripts/CMakeFiles/scripts.dir/EasternKingdoms/zone_blasted_lands.cpp.o
  254. cc1plus: warning: /home/grad/TBC_New/build/src/server/scripts/cotire/scripts_CXX_prefix.hxx.gch: not used because `BOOST_ALL_NO_LIB' is defined [-Winvalid-pch]
  255. [ 34%] Building CXX object src/server/game/CMakeFiles/game.dir/Cache/CharacterCache.cpp.o
  256. cc1plus: warning: /home/grad/TBC_New/build/src/server/game/cotire/game_CXX_prefix.hxx.gch: not used because `BOOST_ALL_NO_LIB' is defined [-Winvalid-pch]
  257. [ 34%] Building CXX object src/server/game/CMakeFiles/game.dir/Chat/Chat.cpp.o
  258. cc1plus: warning: /home/grad/TBC_New/build/src/server/game/cotire/game_CXX_prefix.hxx.gch: not used because `BOOST_ALL_NO_LIB' is defined [-Winvalid-pch]
  259. [ 34%] Building CXX object src/server/game/CMakeFiles/game.dir/Chat/HyperlinkTags.cpp.o
  260. cc1plus: warning: /home/grad/TBC_New/build/src/server/game/cotire/game_CXX_prefix.hxx.gch: not used because `BOOST_ALL_NO_LIB' is defined [-Winvalid-pch]
  261. [ 34%] Building CXX object src/server/game/CMakeFiles/game.dir/Chat/Hyperlinks.cpp.o
  262. cc1plus: warning: /home/grad/TBC_New/build/src/server/game/cotire/game_CXX_prefix.hxx.gch: not used because `BOOST_ALL_NO_LIB' is defined [-Winvalid-pch]
  263. [ 34%] Building CXX object src/server/game/CMakeFiles/game.dir/Chat/ChatCommands/ChatCommandArgs.cpp.o
  264. cc1plus: warning: /home/grad/TBC_New/build/src/server/game/cotire/game_CXX_prefix.hxx.gch: not used because `BOOST_ALL_NO_LIB' is defined [-Winvalid-pch]
  265. [ 35%] Building CXX object src/server/game/CMakeFiles/game.dir/Combat/CombatManager.cpp.o
  266. cc1plus: warning: /home/grad/TBC_New/build/src/server/game/cotire/game_CXX_prefix.hxx.gch: not used because `BOOST_ALL_NO_LIB' is defined [-Winvalid-pch]
  267. [ 35%] Building CXX object src/server/game/CMakeFiles/game.dir/Combat/ThreatManager.cpp.o
  268. cc1plus: warning: /home/grad/TBC_New/build/src/server/game/cotire/game_CXX_prefix.hxx.gch: not used because `BOOST_ALL_NO_LIB' is defined [-Winvalid-pch]
  269. [ 35%] Building CXX object src/server/scripts/CMakeFiles/scripts.dir/EasternKingdoms/zone_burning_steppes.cpp.o
  270. cc1plus: warning: /home/grad/TBC_New/build/src/server/scripts/cotire/scripts_CXX_prefix.hxx.gch: not used because `BOOST_ALL_NO_LIB' is defined [-Winvalid-pch]
  271. [ 35%] Building CXX object src/server/scripts/CMakeFiles/scripts.dir/EasternKingdoms/zone_duskwood.cpp.o
  272. cc1plus: warning: /home/grad/TBC_New/build/src/server/scripts/cotire/scripts_CXX_prefix.hxx.gch: not used because `BOOST_ALL_NO_LIB' is defined [-Winvalid-pch]
  273. [ 35%] Building CXX object src/server/scripts/CMakeFiles/scripts.dir/EasternKingdoms/zone_eastern_plaguelands.cpp.o
  274. cc1plus: warning: /home/grad/TBC_New/build/src/server/scripts/cotire/scripts_CXX_prefix.hxx.gch: not used because `BOOST_ALL_NO_LIB' is defined [-Winvalid-pch]
  275. [ 35%] Building CXX object src/server/game/CMakeFiles/game.dir/Conditions/ConditionMgr.cpp.o
  276. cc1plus: warning: /home/grad/TBC_New/build/src/server/game/cotire/game_CXX_prefix.hxx.gch: not used because `BOOST_ALL_NO_LIB' is defined [-Winvalid-pch]
  277. [ 35%] Building CXX object src/server/game/CMakeFiles/game.dir/DataStores/DBCStores.cpp.o
  278. cc1plus: warning: /home/grad/TBC_New/build/src/server/game/cotire/game_CXX_prefix.hxx.gch: not used because `BOOST_ALL_NO_LIB' is defined [-Winvalid-pch]
  279. /home/grad/TBC_New/src/server/game/Chat/Hyperlinks.cpp: In function ‘bool ValidateLinkInfo(const Trinity::Hyperlinks::HyperlinkInfo&)’:
  280. /home/grad/TBC_New/src/server/game/Chat/Hyperlinks.cpp:336:19: warning: declaration ‘struct Trinity::Hyperlinks::LinkTags::talent’ does not declare anything
  281.   336 |     TryValidateAs(talent);
  282.       |                   ^~~~~~
  283. /home/grad/TBC_New/src/server/game/Chat/Hyperlinks.cpp:310:40: note: in definition of macro ‘TryValidateAs’
  284.   310 |     using taginfo = typename LinkTags::tagname;                                                 \
  285.       |                                        ^~~~~~~
  286. /home/grad/TBC_New/src/server/game/Chat/Hyperlinks.cpp:337:19: warning: declaration ‘struct Trinity::Hyperlinks::LinkTags::area’ does not declare anything
  287.   337 |     TryValidateAs(area);
  288.       |                   ^~~~
  289. /home/grad/TBC_New/src/server/game/Chat/Hyperlinks.cpp:310:40: note: in definition of macro ‘TryValidateAs’
  290.   310 |     using taginfo = typename LinkTags::tagname;                                                 \
  291.       |                                        ^~~~~~~
  292. /home/grad/TBC_New/src/server/game/Chat/Hyperlinks.cpp:338:19: warning: declaration ‘struct Trinity::Hyperlinks::LinkTags::areatrigger’ does not declare anything
  293.   338 |     TryValidateAs(areatrigger);
  294.       |                   ^~~~~~~~~~~
  295. /home/grad/TBC_New/src/server/game/Chat/Hyperlinks.cpp:310:40: note: in definition of macro ‘TryValidateAs’
  296.   310 |     using taginfo = typename LinkTags::tagname;                                                 \
  297.       |                                        ^~~~~~~
  298. /home/grad/TBC_New/src/server/game/Chat/Hyperlinks.cpp:339:19: warning: declaration ‘struct Trinity::Hyperlinks::LinkTags::creature’ does not declare anything
  299.   339 |     TryValidateAs(creature);
  300.       |                   ^~~~~~~~
  301. /home/grad/TBC_New/src/server/game/Chat/Hyperlinks.cpp:310:40: note: in definition of macro ‘TryValidateAs’
  302.   310 |     using taginfo = typename LinkTags::tagname;                                                 \
  303.       |                                        ^~~~~~~
  304. /home/grad/TBC_New/src/server/game/Chat/Hyperlinks.cpp:340:19: warning: declaration ‘struct Trinity::Hyperlinks::LinkTags::creature_entry’ does not declare anything
  305.   340 |     TryValidateAs(creature_entry);
  306.       |                   ^~~~~~~~~~~~~~
  307. /home/grad/TBC_New/src/server/game/Chat/Hyperlinks.cpp:310:40: note: in definition of macro ‘TryValidateAs’
  308.   310 |     using taginfo = typename LinkTags::tagname;                                                 \
  309.       |                                        ^~~~~~~
  310. /home/grad/TBC_New/src/server/game/Chat/Hyperlinks.cpp:341:19: warning: declaration ‘struct Trinity::Hyperlinks::LinkTags::gameevent’ does not declare anything
  311.   341 |     TryValidateAs(gameevent);
  312.       |                   ^~~~~~~~~
  313. /home/grad/TBC_New/src/server/game/Chat/Hyperlinks.cpp:310:40: note: in definition of macro ‘TryValidateAs’
  314.   310 |     using taginfo = typename LinkTags::tagname;                                                 \
  315.       |                                        ^~~~~~~
  316. /home/grad/TBC_New/src/server/game/Chat/Hyperlinks.cpp:342:19: warning: declaration ‘struct Trinity::Hyperlinks::LinkTags::gameobject’ does not declare anything
  317.   342 |     TryValidateAs(gameobject);
  318.       |                   ^~~~~~~~~~
  319. /home/grad/TBC_New/src/server/game/Chat/Hyperlinks.cpp:310:40: note: in definition of macro ‘TryValidateAs’
  320.   310 |     using taginfo = typename LinkTags::tagname;                                                 \
  321.       |                                        ^~~~~~~
  322. /home/grad/TBC_New/src/server/game/Chat/Hyperlinks.cpp:343:19: warning: declaration ‘struct Trinity::Hyperlinks::LinkTags::gameobject_entry’ does not declare anything
  323.   343 |     TryValidateAs(gameobject_entry);
  324.       |                   ^~~~~~~~~~~~~~~~
  325. /home/grad/TBC_New/src/server/game/Chat/Hyperlinks.cpp:310:40: note: in definition of macro ‘TryValidateAs’
  326.   310 |     using taginfo = typename LinkTags::tagname;                                                 \
  327.       |                                        ^~~~~~~
  328. /home/grad/TBC_New/src/server/game/Chat/Hyperlinks.cpp:344:19: warning: declaration ‘struct Trinity::Hyperlinks::LinkTags::item’ does not declare anything
  329.   344 |     TryValidateAs(item);
  330.       |                   ^~~~
  331. /home/grad/TBC_New/src/server/game/Chat/Hyperlinks.cpp:310:40: note: in definition of macro ‘TryValidateAs’
  332.   310 |     using taginfo = typename LinkTags::tagname;                                                 \
  333.       |                                        ^~~~~~~
  334. /home/grad/TBC_New/src/server/game/Chat/Hyperlinks.cpp:345:19: warning: declaration ‘struct Trinity::Hyperlinks::LinkTags::itemset’ does not declare anything
  335.   345 |     TryValidateAs(itemset);
  336.       |                   ^~~~~~~
  337. /home/grad/TBC_New/src/server/game/Chat/Hyperlinks.cpp:310:40: note: in definition of macro ‘TryValidateAs’
  338.   310 |     using taginfo = typename LinkTags::tagname;                                                 \
  339.       |                                        ^~~~~~~
  340. /home/grad/TBC_New/src/server/game/Chat/Hyperlinks.cpp:346:19: warning: declaration ‘struct Trinity::Hyperlinks::LinkTags::player’ does not declare anything
  341.   346 |     TryValidateAs(player);
  342.       |                   ^~~~~~
  343. /home/grad/TBC_New/src/server/game/Chat/Hyperlinks.cpp:310:40: note: in definition of macro ‘TryValidateAs’
  344.   310 |     using taginfo = typename LinkTags::tagname;                                                 \
  345.       |                                        ^~~~~~~
  346. /home/grad/TBC_New/src/server/game/Chat/Hyperlinks.cpp:347:19: warning: declaration ‘struct Trinity::Hyperlinks::LinkTags::quest’ does not declare anything
  347.   347 |     TryValidateAs(quest);
  348.       |                   ^~~~~
  349. /home/grad/TBC_New/src/server/game/Chat/Hyperlinks.cpp:310:40: note: in definition of macro ‘TryValidateAs’
  350.   310 |     using taginfo = typename LinkTags::tagname;                                                 \
  351.       |                                        ^~~~~~~
  352. /home/grad/TBC_New/src/server/game/Chat/Hyperlinks.cpp:348:19: warning: declaration ‘struct Trinity::Hyperlinks::LinkTags::skill’ does not declare anything
  353.   348 |     TryValidateAs(skill);
  354.       |                   ^~~~~
  355. /home/grad/TBC_New/src/server/game/Chat/Hyperlinks.cpp:310:40: note: in definition of macro ‘TryValidateAs’
  356.   310 |     using taginfo = typename LinkTags::tagname;                                                 \
  357.       |                                        ^~~~~~~
  358. /home/grad/TBC_New/src/server/game/Chat/Hyperlinks.cpp:349:19: warning: declaration ‘struct Trinity::Hyperlinks::LinkTags::spell’ does not declare anything
  359.   349 |     TryValidateAs(spell);
  360.       |                   ^~~~~
  361. /home/grad/TBC_New/src/server/game/Chat/Hyperlinks.cpp:310:40: note: in definition of macro ‘TryValidateAs’
  362.   310 |     using taginfo = typename LinkTags::tagname;                                                 \
  363.       |                                        ^~~~~~~
  364. /home/grad/TBC_New/src/server/game/Chat/Hyperlinks.cpp:350:19: warning: declaration ‘struct Trinity::Hyperlinks::LinkTags::taxinode’ does not declare anything
  365.   350 |     TryValidateAs(taxinode);
  366.       |                   ^~~~~~~~
  367. /home/grad/TBC_New/src/server/game/Chat/Hyperlinks.cpp:310:40: note: in definition of macro ‘TryValidateAs’
  368.   310 |     using taginfo = typename LinkTags::tagname;                                                 \
  369.       |                                        ^~~~~~~
  370. /home/grad/TBC_New/src/server/game/Chat/Hyperlinks.cpp:351:19: warning: declaration ‘struct Trinity::Hyperlinks::LinkTags::tele’ does not declare anything
  371.   351 |     TryValidateAs(tele);
  372.       |                   ^~~~
  373. /home/grad/TBC_New/src/server/game/Chat/Hyperlinks.cpp:310:40: note: in definition of macro ‘TryValidateAs’
  374.   310 |     using taginfo = typename LinkTags::tagname;                                                 \
  375.       |                                        ^~~~~~~
  376. /home/grad/TBC_New/src/server/game/Chat/Hyperlinks.cpp:352:19: warning: declaration ‘struct Trinity::Hyperlinks::LinkTags::title’ does not declare anything
  377.   352 |     TryValidateAs(title);
  378.       |                   ^~~~~
  379. /home/grad/TBC_New/src/server/game/Chat/Hyperlinks.cpp:310:40: note: in definition of macro ‘TryValidateAs’
  380.   310 |     using taginfo = typename LinkTags::tagname;                                                 \
  381.       |                                        ^~~~~~~
  382. [ 35%] Building CXX object src/server/game/CMakeFiles/game.dir/DataStores/M2Stores.cpp.o
  383. cc1plus: warning: /home/grad/TBC_New/build/src/server/game/cotire/game_CXX_prefix.hxx.gch: not used because `BOOST_ALL_NO_LIB' is defined [-Winvalid-pch]
  384. [ 35%] Building CXX object src/server/game/CMakeFiles/game.dir/Entities/Corpse/Corpse.cpp.o
  385. cc1plus: warning: /home/grad/TBC_New/build/src/server/game/cotire/game_CXX_prefix.hxx.gch: not used because `BOOST_ALL_NO_LIB' is defined [-Winvalid-pch]
  386. [ 36%] Building CXX object src/server/scripts/CMakeFiles/scripts.dir/EasternKingdoms/zone_eversong_woods.cpp.o
  387. cc1plus: warning: /home/grad/TBC_New/build/src/server/scripts/cotire/scripts_CXX_prefix.hxx.gch: not used because `BOOST_ALL_NO_LIB' is defined [-Winvalid-pch]
  388. [ 36%] Building CXX object src/server/scripts/CMakeFiles/scripts.dir/EasternKingdoms/zone_ghostlands.cpp.o
  389. cc1plus: warning: /home/grad/TBC_New/build/src/server/scripts/cotire/scripts_CXX_prefix.hxx.gch: not used because `BOOST_ALL_NO_LIB' is defined [-Winvalid-pch]
  390. [ 36%] Building CXX object src/server/game/CMakeFiles/game.dir/Entities/Creature/Creature.cpp.o
  391. cc1plus: warning: /home/grad/TBC_New/build/src/server/game/cotire/game_CXX_prefix.hxx.gch: not used because `BOOST_ALL_NO_LIB' is defined [-Winvalid-pch]
  392. [ 36%] Building CXX object src/server/scripts/CMakeFiles/scripts.dir/EasternKingdoms/zone_hinterlands.cpp.o
  393. cc1plus: warning: /home/grad/TBC_New/build/src/server/scripts/cotire/scripts_CXX_prefix.hxx.gch: not used because `BOOST_ALL_NO_LIB' is defined [-Winvalid-pch]
  394. [ 36%] Building CXX object src/server/game/CMakeFiles/game.dir/Entities/Creature/CreatureGroups.cpp.o
  395. cc1plus: warning: /home/grad/TBC_New/build/src/server/game/cotire/game_CXX_prefix.hxx.gch: not used because `BOOST_ALL_NO_LIB' is defined [-Winvalid-pch]
  396. [ 36%] Building CXX object src/server/scripts/CMakeFiles/scripts.dir/EasternKingdoms/zone_ironforge.cpp.o
  397. cc1plus: warning: /home/grad/TBC_New/build/src/server/scripts/cotire/scripts_CXX_prefix.hxx.gch: not used because `BOOST_ALL_NO_LIB' is defined [-Winvalid-pch]
  398. [ 37%] Building CXX object src/server/game/CMakeFiles/game.dir/Entities/Creature/GossipDef.cpp.o
  399. cc1plus: warning: /home/grad/TBC_New/build/src/server/game/cotire/game_CXX_prefix.hxx.gch: not used because `BOOST_ALL_NO_LIB' is defined [-Winvalid-pch]
  400. [ 37%] Building CXX object src/server/game/CMakeFiles/game.dir/Entities/Creature/TemporarySummon.cpp.o
  401. cc1plus: warning: /home/grad/TBC_New/build/src/server/game/cotire/game_CXX_prefix.hxx.gch: not used because `BOOST_ALL_NO_LIB' is defined [-Winvalid-pch]
  402. [ 37%] Building CXX object src/server/game/CMakeFiles/game.dir/Entities/Creature/Trainer.cpp.o
  403. cc1plus: warning: /home/grad/TBC_New/build/src/server/game/cotire/game_CXX_prefix.hxx.gch: not used because `BOOST_ALL_NO_LIB' is defined [-Winvalid-pch]
  404. [ 37%] Building CXX object src/server/scripts/CMakeFiles/scripts.dir/EasternKingdoms/zone_isle_of_queldanas.cpp.o
  405. cc1plus: warning: /home/grad/TBC_New/build/src/server/scripts/cotire/scripts_CXX_prefix.hxx.gch: not used because `BOOST_ALL_NO_LIB' is defined [-Winvalid-pch]
  406. [ 37%] Building CXX object src/server/game/CMakeFiles/game.dir/Entities/DynamicObject/DynamicObject.cpp.o
  407. cc1plus: warning: /home/grad/TBC_New/build/src/server/game/cotire/game_CXX_prefix.hxx.gch: not used because `BOOST_ALL_NO_LIB' is defined [-Winvalid-pch]
  408. [ 37%] Building CXX object src/server/scripts/CMakeFiles/scripts.dir/EasternKingdoms/zone_loch_modan.cpp.o
  409. cc1plus: warning: /home/grad/TBC_New/build/src/server/scripts/cotire/scripts_CXX_prefix.hxx.gch: not used because `BOOST_ALL_NO_LIB' is defined [-Winvalid-pch]
  410. [ 37%] Building CXX object src/server/game/CMakeFiles/game.dir/Entities/GameObject/GameObject.cpp.o
  411. cc1plus: warning: /home/grad/TBC_New/build/src/server/game/cotire/game_CXX_prefix.hxx.gch: not used because `BOOST_ALL_NO_LIB' is defined [-Winvalid-pch]
  412. [ 37%] Building CXX object src/server/game/CMakeFiles/game.dir/Entities/Item/Item.cpp.o
  413. cc1plus: warning: /home/grad/TBC_New/build/src/server/game/cotire/game_CXX_prefix.hxx.gch: not used because `BOOST_ALL_NO_LIB' is defined [-Winvalid-pch]
  414. [ 37%] Building CXX object src/server/scripts/CMakeFiles/scripts.dir/EasternKingdoms/zone_redridge_mountains.cpp.o
  415. cc1plus: warning: /home/grad/TBC_New/build/src/server/scripts/cotire/scripts_CXX_prefix.hxx.gch: not used because `BOOST_ALL_NO_LIB' is defined [-Winvalid-pch]
  416. [ 37%] Building CXX object src/server/scripts/CMakeFiles/scripts.dir/EasternKingdoms/zone_silvermoon.cpp.o
  417. cc1plus: warning: /home/grad/TBC_New/build/src/server/scripts/cotire/scripts_CXX_prefix.hxx.gch: not used because `BOOST_ALL_NO_LIB' is defined [-Winvalid-pch]
  418. [ 37%] Building CXX object src/server/game/CMakeFiles/game.dir/Entities/Item/ItemEnchantmentMgr.cpp.o
  419. cc1plus: warning: /home/grad/TBC_New/build/src/server/game/cotire/game_CXX_prefix.hxx.gch: not used because `BOOST_ALL_NO_LIB' is defined [-Winvalid-pch]
  420. [ 37%] Building CXX object src/server/game/CMakeFiles/game.dir/Entities/Item/ItemTemplate.cpp.o
  421. cc1plus: warning: /home/grad/TBC_New/build/src/server/game/cotire/game_CXX_prefix.hxx.gch: not used because `BOOST_ALL_NO_LIB' is defined [-Winvalid-pch]
  422. [ 37%] Building CXX object src/server/scripts/CMakeFiles/scripts.dir/EasternKingdoms/zone_silverpine_forest.cpp.o
  423. [ 38%] Building CXX object src/server/scripts/CMakeFiles/scripts.dir/EasternKingdoms/zone_stormwind_city.cpp.o
  424. cc1plus: warning: /home/grad/TBC_New/build/src/server/scripts/cotire/scripts_CXX_prefix.hxx.gch: not used because `BOOST_ALL_NO_LIB' is defined [-Winvalid-pch]
  425. cc1plus: warning: /home/grad/TBC_New/build/src/server/scripts/cotire/scripts_CXX_prefix.hxx.gch: not used because `BOOST_ALL_NO_LIB' is defined [-Winvalid-pch]
  426. [ 38%] Building CXX object src/server/game/CMakeFiles/game.dir/Entities/Item/Container/Bag.cpp.o
  427. cc1plus: warning: /home/grad/TBC_New/build/src/server/game/cotire/game_CXX_prefix.hxx.gch: not used because `BOOST_ALL_NO_LIB' is defined [-Winvalid-pch]
  428. [ 39%] Building CXX object src/server/game/CMakeFiles/game.dir/Entities/Object/Object.cpp.o
  429. cc1plus: warning: /home/grad/TBC_New/build/src/server/game/cotire/game_CXX_prefix.hxx.gch: not used because `BOOST_ALL_NO_LIB' is defined [-Winvalid-pch]
  430. [ 39%] Building CXX object src/server/scripts/CMakeFiles/scripts.dir/EasternKingdoms/zone_stranglethorn_vale.cpp.o
  431. cc1plus: warning: /home/grad/TBC_New/build/src/server/scripts/cotire/scripts_CXX_prefix.hxx.gch: not used because `BOOST_ALL_NO_LIB' is defined [-Winvalid-pch]
  432. [ 39%] Building CXX object src/server/scripts/CMakeFiles/scripts.dir/EasternKingdoms/zone_swamp_of_sorrows.cpp.o
  433. cc1plus: warning: /home/grad/TBC_New/build/src/server/scripts/cotire/scripts_CXX_prefix.hxx.gch: not used because `BOOST_ALL_NO_LIB' is defined [-Winvalid-pch]
  434. [ 39%] Building CXX object src/server/game/CMakeFiles/game.dir/Entities/Object/ObjectGuid.cpp.o
  435. cc1plus: warning: /home/grad/TBC_New/build/src/server/game/cotire/game_CXX_prefix.hxx.gch: not used because `BOOST_ALL_NO_LIB' is defined [-Winvalid-pch]
  436. [ 39%] Building CXX object src/server/scripts/CMakeFiles/scripts.dir/EasternKingdoms/zone_tirisfal_glades.cpp.o
  437. cc1plus: warning: /home/grad/TBC_New/build/src/server/scripts/cotire/scripts_CXX_prefix.hxx.gch: not used because `BOOST_ALL_NO_LIB' is defined [-Winvalid-pch]
  438. [ 39%] Building CXX object src/server/game/CMakeFiles/game.dir/Entities/Object/ObjectPosSelector.cpp.o
  439. cc1plus: warning: /home/grad/TBC_New/build/src/server/game/cotire/game_CXX_prefix.hxx.gch: not used because `BOOST_ALL_NO_LIB' is defined [-Winvalid-pch]
  440. [ 39%] Building CXX object src/server/scripts/CMakeFiles/scripts.dir/EasternKingdoms/zone_undercity.cpp.o
  441. cc1plus: warning: /home/grad/TBC_New/build/src/server/scripts/cotire/scripts_CXX_prefix.hxx.gch: not used because `BOOST_ALL_NO_LIB' is defined [-Winvalid-pch]
  442. [ 39%] Building CXX object src/server/game/CMakeFiles/game.dir/Entities/Object/Position.cpp.o
  443. cc1plus: warning: /home/grad/TBC_New/build/src/server/game/cotire/game_CXX_prefix.hxx.gch: not used because `BOOST_ALL_NO_LIB' is defined [-Winvalid-pch]
  444. [ 39%] Building CXX object src/server/scripts/CMakeFiles/scripts.dir/EasternKingdoms/zone_western_plaguelands.cpp.o
  445. cc1plus: warning: /home/grad/TBC_New/build/src/server/scripts/cotire/scripts_CXX_prefix.hxx.gch: not used because `BOOST_ALL_NO_LIB' is defined [-Winvalid-pch]
  446. [ 39%] Building CXX object src/server/game/CMakeFiles/game.dir/Entities/Object/Updates/UpdateData.cpp.o
  447. cc1plus: warning: /home/grad/TBC_New/build/src/server/game/cotire/game_CXX_prefix.hxx.gch: not used because `BOOST_ALL_NO_LIB' is defined [-Winvalid-pch]
  448. [ 39%] Building CXX object src/server/game/CMakeFiles/game.dir/Entities/Object/Updates/UpdateFieldFlags.cpp.o
  449. cc1plus: warning: /home/grad/TBC_New/build/src/server/game/cotire/game_CXX_prefix.hxx.gch: not used because `BOOST_ALL_NO_LIB' is defined [-Winvalid-pch]
  450. [ 39%] Building CXX object src/server/game/CMakeFiles/game.dir/Entities/Object/Updates/UpdateFieldsDebug.cpp.o
  451. cc1plus: warning: /home/grad/TBC_New/build/src/server/game/cotire/game_CXX_prefix.hxx.gch: not used because `BOOST_ALL_NO_LIB' is defined [-Winvalid-pch]
  452. [ 39%] Building CXX object src/server/game/CMakeFiles/game.dir/Entities/Pet/Pet.cpp.o
  453. cc1plus: warning: /home/grad/TBC_New/build/src/server/game/cotire/game_CXX_prefix.hxx.gch: not used because `BOOST_ALL_NO_LIB' is defined [-Winvalid-pch]
  454. [ 40%] Building CXX object src/server/game/CMakeFiles/game.dir/Entities/Player/CinematicMgr.cpp.o
  455. cc1plus: warning: /home/grad/TBC_New/build/src/server/game/cotire/game_CXX_prefix.hxx.gch: not used because `BOOST_ALL_NO_LIB' is defined [-Winvalid-pch]
  456. [ 40%] Building CXX object src/server/scripts/CMakeFiles/scripts.dir/EasternKingdoms/zone_westfall.cpp.o
  457. cc1plus: warning: /home/grad/TBC_New/build/src/server/scripts/cotire/scripts_CXX_prefix.hxx.gch: not used because `BOOST_ALL_NO_LIB' is defined [-Winvalid-pch]
  458. [ 40%] Building CXX object src/server/scripts/CMakeFiles/scripts.dir/EasternKingdoms/zone_wetlands.cpp.o
  459. cc1plus: warning: /home/grad/TBC_New/build/src/server/scripts/cotire/scripts_CXX_prefix.hxx.gch: not used because `BOOST_ALL_NO_LIB' is defined [-Winvalid-pch]
  460. [ 41%] Building CXX object src/server/scripts/CMakeFiles/scripts.dir/EasternKingdoms/BlackrockMountain/BlackrockDepths/blackrock_depths.cpp.o
  461. cc1plus: warning: /home/grad/TBC_New/build/src/server/scripts/cotire/scripts_CXX_prefix.hxx.gch: not used because `BOOST_ALL_NO_LIB' is defined [-Winvalid-pch]
  462. [ 41%] Building CXX object src/server/scripts/CMakeFiles/scripts.dir/EasternKingdoms/BlackrockMountain/BlackrockDepths/boss_ambassador_flamelash.cpp.o
  463. cc1plus: warning: /home/grad/TBC_New/build/src/server/scripts/cotire/scripts_CXX_prefix.hxx.gch: not used because `BOOST_ALL_NO_LIB' is defined [-Winvalid-pch]
  464. [ 41%] Building CXX object src/server/game/CMakeFiles/game.dir/Entities/Player/Player.cpp.o
  465. cc1plus: warning: /home/grad/TBC_New/build/src/server/game/cotire/game_CXX_prefix.hxx.gch: not used because `BOOST_ALL_NO_LIB' is defined [-Winvalid-pch]
  466. [ 41%] Building CXX object src/server/game/CMakeFiles/game.dir/Entities/Player/SocialMgr.cpp.o
  467. cc1plus: warning: /home/grad/TBC_New/build/src/server/game/cotire/game_CXX_prefix.hxx.gch: not used because `BOOST_ALL_NO_LIB' is defined [-Winvalid-pch]
  468. [ 41%] Building CXX object src/server/game/CMakeFiles/game.dir/Entities/Player/TradeData.cpp.o
  469. cc1plus: warning: /home/grad/TBC_New/build/src/server/game/cotire/game_CXX_prefix.hxx.gch: not used because `BOOST_ALL_NO_LIB' is defined [-Winvalid-pch]
  470. [ 41%] Building CXX object src/server/game/CMakeFiles/game.dir/Entities/Totem/Totem.cpp.o
  471. cc1plus: warning: /home/grad/TBC_New/build/src/server/game/cotire/game_CXX_prefix.hxx.gch: not used because `BOOST_ALL_NO_LIB' is defined [-Winvalid-pch]
  472. [ 41%] Building CXX object src/server/game/CMakeFiles/game.dir/Entities/Transport/Transport.cpp.o
  473. cc1plus: warning: /home/grad/TBC_New/build/src/server/game/cotire/game_CXX_prefix.hxx.gch: not used because `BOOST_ALL_NO_LIB' is defined [-Winvalid-pch]
  474. [ 41%] Building CXX object src/server/game/CMakeFiles/game.dir/Entities/Unit/StatSystem.cpp.o
  475. cc1plus: warning: /home/grad/TBC_New/build/src/server/game/cotire/game_CXX_prefix.hxx.gch: not used because `BOOST_ALL_NO_LIB' is defined [-Winvalid-pch]
  476. [ 41%] Building CXX object src/server/game/CMakeFiles/game.dir/Entities/Unit/Unit.cpp.o
  477. cc1plus: warning: /home/grad/TBC_New/build/src/server/game/cotire/game_CXX_prefix.hxx.gch: not used because `BOOST_ALL_NO_LIB' is defined [-Winvalid-pch]
  478. [ 41%] Building CXX object src/server/game/CMakeFiles/game.dir/Globals/ObjectAccessor.cpp.o
  479. cc1plus: warning: /home/grad/TBC_New/build/src/server/game/cotire/game_CXX_prefix.hxx.gch: not used because `BOOST_ALL_NO_LIB' is defined [-Winvalid-pch]
  480. [ 42%] Building CXX object src/server/game/CMakeFiles/game.dir/Globals/ObjectMgr.cpp.o
  481. cc1plus: warning: /home/grad/TBC_New/build/src/server/game/cotire/game_CXX_prefix.hxx.gch: not used because `BOOST_ALL_NO_LIB' is defined [-Winvalid-pch]
  482. [ 42%] Building CXX object src/server/scripts/CMakeFiles/scripts.dir/EasternKingdoms/BlackrockMountain/BlackrockDepths/boss_coren_direbrew.cpp.o
  483. cc1plus: warning: /home/grad/TBC_New/build/src/server/scripts/cotire/scripts_CXX_prefix.hxx.gch: not used because `BOOST_ALL_NO_LIB' is defined [-Winvalid-pch]
  484. [ 42%] Building CXX object src/server/game/CMakeFiles/game.dir/Grids/GridStates.cpp.o
  485. cc1plus: warning: /home/grad/TBC_New/build/src/server/game/cotire/game_CXX_prefix.hxx.gch: not used because `BOOST_ALL_NO_LIB' is defined [-Winvalid-pch]
  486. [ 42%] Building CXX object src/server/scripts/CMakeFiles/scripts.dir/EasternKingdoms/BlackrockMountain/BlackrockDepths/boss_emperor_dagran_thaurissan.cpp.o
  487. cc1plus: warning: /home/grad/TBC_New/build/src/server/scripts/cotire/scripts_CXX_prefix.hxx.gch: not used because `BOOST_ALL_NO_LIB' is defined [-Winvalid-pch]
  488. [ 42%] Building CXX object src/server/game/CMakeFiles/game.dir/Grids/NGrid.cpp.o
  489. cc1plus: warning: /home/grad/TBC_New/build/src/server/game/cotire/game_CXX_prefix.hxx.gch: not used because `BOOST_ALL_NO_LIB' is defined [-Winvalid-pch]
  490. /home/grad/TBC_New/src/server/game/Entities/Unit/Unit.cpp: In member function ‘Unit* Unit::SelectNearbyNoTotemTarget(Unit*, float) const’:
  491. /home/grad/TBC_New/src/server/game/Entities/Unit/Unit.cpp:9670:5: error: ‘VisitNearbyObject’ was not declared in this scope
  492.  9670 |     VisitNearbyObject(dist, searcher);
  493.       |     ^~~~~~~~~~~~~~~~~
  494. make[2]: *** [src/server/game/CMakeFiles/game.dir/build.make:1539: src/server/game/CMakeFiles/game.dir/Entities/Unit/Unit.cpp.o] Ошибка 1
  495. make[2]: *** Ожидание завершения заданий…
  496. [ 42%] Building CXX object src/server/scripts/CMakeFiles/scripts.dir/EasternKingdoms/BlackrockMountain/BlackrockDepths/boss_general_angerforge.cpp.o
  497. cc1plus: warning: /home/grad/TBC_New/build/src/server/scripts/cotire/scripts_CXX_prefix.hxx.gch: not used because `BOOST_ALL_NO_LIB' is defined [-Winvalid-pch]
  498. [ 42%] Building CXX object src/server/scripts/CMakeFiles/scripts.dir/EasternKingdoms/BlackrockMountain/BlackrockDepths/boss_high_interrogator_gerstahn.cpp.o
  499. cc1plus: warning: /home/grad/TBC_New/build/src/server/scripts/cotire/scripts_CXX_prefix.hxx.gch: not used because `BOOST_ALL_NO_LIB' is defined [-Winvalid-pch]
  500. [ 42%] Building CXX object src/server/scripts/CMakeFiles/scripts.dir/EasternKingdoms/BlackrockMountain/BlackrockDepths/boss_magmus.cpp.o
  501. cc1plus: warning: /home/grad/TBC_New/build/src/server/scripts/cotire/scripts_CXX_prefix.hxx.gch: not used because `BOOST_ALL_NO_LIB' is defined [-Winvalid-pch]
  502. [ 42%] Building CXX object src/server/scripts/CMakeFiles/scripts.dir/EasternKingdoms/BlackrockMountain/BlackrockDepths/boss_moira_bronzebeard.cpp.o
  503. cc1plus: warning: /home/grad/TBC_New/build/src/server/scripts/cotire/scripts_CXX_prefix.hxx.gch: not used because `BOOST_ALL_NO_LIB' is defined [-Winvalid-pch]
  504. [ 42%] Building CXX object src/server/scripts/CMakeFiles/scripts.dir/EasternKingdoms/BlackrockMountain/BlackrockDepths/boss_tomb_of_seven.cpp.o
  505. cc1plus: warning: /home/grad/TBC_New/build/src/server/scripts/cotire/scripts_CXX_prefix.hxx.gch: not used because `BOOST_ALL_NO_LIB' is defined [-Winvalid-pch]
  506. [ 43%] Building CXX object src/server/scripts/CMakeFiles/scripts.dir/EasternKingdoms/BlackrockMountain/BlackrockDepths/instance_blackrock_depths.cpp.o
  507. cc1plus: warning: /home/grad/TBC_New/build/src/server/scripts/cotire/scripts_CXX_prefix.hxx.gch: not used because `BOOST_ALL_NO_LIB' is defined [-Winvalid-pch]
  508. [ 43%] Building CXX object src/server/scripts/CMakeFiles/scripts.dir/EasternKingdoms/BlackrockMountain/BlackrockSpire/boss_drakkisath.cpp.o
  509. cc1plus: warning: /home/grad/TBC_New/build/src/server/scripts/cotire/scripts_CXX_prefix.hxx.gch: not used because `BOOST_ALL_NO_LIB' is defined [-Winvalid-pch]
  510. [ 43%] Building CXX object src/server/scripts/CMakeFiles/scripts.dir/EasternKingdoms/BlackrockMountain/BlackrockSpire/boss_gizrul_the_slavener.cpp.o
  511. cc1plus: warning: /home/grad/TBC_New/build/src/server/scripts/cotire/scripts_CXX_prefix.hxx.gch: not used because `BOOST_ALL_NO_LIB' is defined [-Winvalid-pch]
  512. [ 43%] Building CXX object src/server/scripts/CMakeFiles/scripts.dir/EasternKingdoms/BlackrockMountain/BlackrockSpire/boss_gyth.cpp.o
  513. cc1plus: warning: /home/grad/TBC_New/build/src/server/scripts/cotire/scripts_CXX_prefix.hxx.gch: not used because `BOOST_ALL_NO_LIB' is defined [-Winvalid-pch]
  514. [ 43%] Building CXX object src/server/scripts/CMakeFiles/scripts.dir/EasternKingdoms/BlackrockMountain/BlackrockSpire/boss_halycon.cpp.o
  515. cc1plus: warning: /home/grad/TBC_New/build/src/server/scripts/cotire/scripts_CXX_prefix.hxx.gch: not used because `BOOST_ALL_NO_LIB' is defined [-Winvalid-pch]
  516. [ 43%] Building CXX object src/server/scripts/CMakeFiles/scripts.dir/EasternKingdoms/BlackrockMountain/BlackrockSpire/boss_highlord_omokk.cpp.o
  517. cc1plus: warning: /home/grad/TBC_New/build/src/server/scripts/cotire/scripts_CXX_prefix.hxx.gch: not used because `BOOST_ALL_NO_LIB' is defined [-Winvalid-pch]
  518. [ 43%] Building CXX object src/server/scripts/CMakeFiles/scripts.dir/EasternKingdoms/BlackrockMountain/BlackrockSpire/boss_lord_valthalak.cpp.o
  519. cc1plus: warning: /home/grad/TBC_New/build/src/server/scripts/cotire/scripts_CXX_prefix.hxx.gch: not used because `BOOST_ALL_NO_LIB' is defined [-Winvalid-pch]
  520. [ 43%] Building CXX object src/server/scripts/CMakeFiles/scripts.dir/EasternKingdoms/BlackrockMountain/BlackrockSpire/boss_mother_smolderweb.cpp.o
  521. cc1plus: warning: /home/grad/TBC_New/build/src/server/scripts/cotire/scripts_CXX_prefix.hxx.gch: not used because `BOOST_ALL_NO_LIB' is defined [-Winvalid-pch]
  522. [ 44%] Building CXX object src/server/scripts/CMakeFiles/scripts.dir/EasternKingdoms/BlackrockMountain/BlackrockSpire/boss_overlord_wyrmthalak.cpp.o
  523. cc1plus: warning: /home/grad/TBC_New/build/src/server/scripts/cotire/scripts_CXX_prefix.hxx.gch: not used because `BOOST_ALL_NO_LIB' is defined [-Winvalid-pch]
  524. [ 44%] Building CXX object src/server/scripts/CMakeFiles/scripts.dir/EasternKingdoms/BlackrockMountain/BlackrockSpire/boss_pyroguard_emberseer.cpp.o
  525. cc1plus: warning: /home/grad/TBC_New/build/src/server/scripts/cotire/scripts_CXX_prefix.hxx.gch: not used because `BOOST_ALL_NO_LIB' is defined [-Winvalid-pch]
  526. [ 44%] Building CXX object src/server/scripts/CMakeFiles/scripts.dir/EasternKingdoms/BlackrockMountain/BlackrockSpire/boss_quartermaster_zigris.cpp.o
  527. cc1plus: warning: /home/grad/TBC_New/build/src/server/scripts/cotire/scripts_CXX_prefix.hxx.gch: not used because `BOOST_ALL_NO_LIB' is defined [-Winvalid-pch]
  528. [ 44%] Building CXX object src/server/scripts/CMakeFiles/scripts.dir/EasternKingdoms/BlackrockMountain/BlackrockSpire/boss_rend_blackhand.cpp.o
  529. cc1plus: warning: /home/grad/TBC_New/build/src/server/scripts/cotire/scripts_CXX_prefix.hxx.gch: not used because `BOOST_ALL_NO_LIB' is defined [-Winvalid-pch]
  530. [ 44%] Building CXX object src/server/scripts/CMakeFiles/scripts.dir/EasternKingdoms/BlackrockMountain/BlackrockSpire/boss_shadow_hunter_voshgajin.cpp.o
  531. cc1plus: warning: /home/grad/TBC_New/build/src/server/scripts/cotire/scripts_CXX_prefix.hxx.gch: not used because `BOOST_ALL_NO_LIB' is defined [-Winvalid-pch]
  532. [ 44%] Building CXX object src/server/scripts/CMakeFiles/scripts.dir/EasternKingdoms/BlackrockMountain/BlackrockSpire/boss_the_beast.cpp.o
  533. cc1plus: warning: /home/grad/TBC_New/build/src/server/scripts/cotire/scripts_CXX_prefix.hxx.gch: not used because `BOOST_ALL_NO_LIB' is defined [-Winvalid-pch]
  534. [ 44%] Building CXX object src/server/scripts/CMakeFiles/scripts.dir/EasternKingdoms/BlackrockMountain/BlackrockSpire/boss_urok_doomhowl.cpp.o
  535. cc1plus: warning: /home/grad/TBC_New/build/src/server/scripts/cotire/scripts_CXX_prefix.hxx.gch: not used because `BOOST_ALL_NO_LIB' is defined [-Winvalid-pch]
  536. [ 44%] Building CXX object src/server/scripts/CMakeFiles/scripts.dir/EasternKingdoms/BlackrockMountain/BlackrockSpire/boss_warmaster_voone.cpp.o
  537. cc1plus: warning: /home/grad/TBC_New/build/src/server/scripts/cotire/scripts_CXX_prefix.hxx.gch: not used because `BOOST_ALL_NO_LIB' is defined [-Winvalid-pch]
  538. [ 44%] Building CXX object src/server/scripts/CMakeFiles/scripts.dir/EasternKingdoms/BlackrockMountain/BlackrockSpire/instance_blackrock_spire.cpp.o
  539. cc1plus: warning: /home/grad/TBC_New/build/src/server/scripts/cotire/scripts_CXX_prefix.hxx.gch: not used because `BOOST_ALL_NO_LIB' is defined [-Winvalid-pch]
  540. [ 45%] Building CXX object src/server/scripts/CMakeFiles/scripts.dir/EasternKingdoms/BlackrockMountain/BlackwingLair/boss_broodlord_lashlayer.cpp.o
  541. cc1plus: warning: /home/grad/TBC_New/build/src/server/scripts/cotire/scripts_CXX_prefix.hxx.gch: not used because `BOOST_ALL_NO_LIB' is defined [-Winvalid-pch]
  542. [ 45%] Building CXX object src/server/scripts/CMakeFiles/scripts.dir/EasternKingdoms/BlackrockMountain/BlackwingLair/boss_chromaggus.cpp.o
  543. cc1plus: warning: /home/grad/TBC_New/build/src/server/scripts/cotire/scripts_CXX_prefix.hxx.gch: not used because `BOOST_ALL_NO_LIB' is defined [-Winvalid-pch]
  544. [ 45%] Building CXX object src/server/scripts/CMakeFiles/scripts.dir/EasternKingdoms/BlackrockMountain/BlackwingLair/boss_ebonroc.cpp.o
  545. cc1plus: warning: /home/grad/TBC_New/build/src/server/scripts/cotire/scripts_CXX_prefix.hxx.gch: not used because `BOOST_ALL_NO_LIB' is defined [-Winvalid-pch]
  546. [ 45%] Building CXX object src/server/scripts/CMakeFiles/scripts.dir/EasternKingdoms/BlackrockMountain/BlackwingLair/boss_firemaw.cpp.o
  547. cc1plus: warning: /home/grad/TBC_New/build/src/server/scripts/cotire/scripts_CXX_prefix.hxx.gch: not used because `BOOST_ALL_NO_LIB' is defined [-Winvalid-pch]
  548. [ 45%] Building CXX object src/server/scripts/CMakeFiles/scripts.dir/EasternKingdoms/BlackrockMountain/BlackwingLair/boss_flamegor.cpp.o
  549. cc1plus: warning: /home/grad/TBC_New/build/src/server/scripts/cotire/scripts_CXX_prefix.hxx.gch: not used because `BOOST_ALL_NO_LIB' is defined [-Winvalid-pch]
  550. [ 45%] Building CXX object src/server/scripts/CMakeFiles/scripts.dir/EasternKingdoms/BlackrockMountain/BlackwingLair/boss_nefarian.cpp.o
  551. cc1plus: warning: /home/grad/TBC_New/build/src/server/scripts/cotire/scripts_CXX_prefix.hxx.gch: not used because `BOOST_ALL_NO_LIB' is defined [-Winvalid-pch]
  552. [ 45%] Building CXX object src/server/scripts/CMakeFiles/scripts.dir/EasternKingdoms/BlackrockMountain/BlackwingLair/boss_razorgore.cpp.o
  553. cc1plus: warning: /home/grad/TBC_New/build/src/server/scripts/cotire/scripts_CXX_prefix.hxx.gch: not used because `BOOST_ALL_NO_LIB' is defined [-Winvalid-pch]
  554. [ 45%] Building CXX object src/server/scripts/CMakeFiles/scripts.dir/EasternKingdoms/BlackrockMountain/BlackwingLair/boss_vaelastrasz.cpp.o
  555. cc1plus: warning: /home/grad/TBC_New/build/src/server/scripts/cotire/scripts_CXX_prefix.hxx.gch: not used because `BOOST_ALL_NO_LIB' is defined [-Winvalid-pch]
  556. [ 46%] Building CXX object src/server/scripts/CMakeFiles/scripts.dir/EasternKingdoms/BlackrockMountain/BlackwingLair/instance_blackwing_lair.cpp.o
  557. cc1plus: warning: /home/grad/TBC_New/build/src/server/scripts/cotire/scripts_CXX_prefix.hxx.gch: not used because `BOOST_ALL_NO_LIB' is defined [-Winvalid-pch]
  558. [ 46%] Building CXX object src/server/scripts/CMakeFiles/scripts.dir/EasternKingdoms/BlackrockMountain/MoltenCore/boss_baron_geddon.cpp.o
  559. cc1plus: warning: /home/grad/TBC_New/build/src/server/scripts/cotire/scripts_CXX_prefix.hxx.gch: not used because `BOOST_ALL_NO_LIB' is defined [-Winvalid-pch]
  560. [ 46%] Building CXX object src/server/scripts/CMakeFiles/scripts.dir/EasternKingdoms/BlackrockMountain/MoltenCore/boss_garr.cpp.o
  561. cc1plus: warning: /home/grad/TBC_New/build/src/server/scripts/cotire/scripts_CXX_prefix.hxx.gch: not used because `BOOST_ALL_NO_LIB' is defined [-Winvalid-pch]
  562. [ 46%] Building CXX object src/server/scripts/CMakeFiles/scripts.dir/EasternKingdoms/BlackrockMountain/MoltenCore/boss_gehennas.cpp.o
  563. cc1plus: warning: /home/grad/TBC_New/build/src/server/scripts/cotire/scripts_CXX_prefix.hxx.gch: not used because `BOOST_ALL_NO_LIB' is defined [-Winvalid-pch]
  564. [ 46%] Building CXX object src/server/scripts/CMakeFiles/scripts.dir/EasternKingdoms/BlackrockMountain/MoltenCore/boss_golemagg.cpp.o
  565. cc1plus: warning: /home/grad/TBC_New/build/src/server/scripts/cotire/scripts_CXX_prefix.hxx.gch: not used because `BOOST_ALL_NO_LIB' is defined [-Winvalid-pch]
  566. [ 46%] Building CXX object src/server/scripts/CMakeFiles/scripts.dir/EasternKingdoms/BlackrockMountain/MoltenCore/boss_lucifron.cpp.o
  567. cc1plus: warning: /home/grad/TBC_New/build/src/server/scripts/cotire/scripts_CXX_prefix.hxx.gch: not used because `BOOST_ALL_NO_LIB' is defined [-Winvalid-pch]
  568. [ 46%] Building CXX object src/server/scripts/CMakeFiles/scripts.dir/EasternKingdoms/BlackrockMountain/MoltenCore/boss_magmadar.cpp.o
  569. cc1plus: warning: /home/grad/TBC_New/build/src/server/scripts/cotire/scripts_CXX_prefix.hxx.gch: not used because `BOOST_ALL_NO_LIB' is defined [-Winvalid-pch]
  570. make[1]: *** [CMakeFiles/Makefile2:1108: src/server/game/CMakeFiles/game.dir/all] Ошибка 2
  571. make[1]: *** Ожидание завершения заданий…
  572. [ 46%] Building CXX object src/server/scripts/CMakeFiles/scripts.dir/EasternKingdoms/BlackrockMountain/MoltenCore/boss_majordomo_executus.cpp.o
  573. cc1plus: warning: /home/grad/TBC_New/build/src/server/scripts/cotire/scripts_CXX_prefix.hxx.gch: not used because `BOOST_ALL_NO_LIB' is defined [-Winvalid-pch]
  574. [ 46%] Building CXX object src/server/scripts/CMakeFiles/scripts.dir/EasternKingdoms/BlackrockMountain/MoltenCore/boss_ragnaros.cpp.o
  575. cc1plus: warning: /home/grad/TBC_New/build/src/server/scripts/cotire/scripts_CXX_prefix.hxx.gch: not used because `BOOST_ALL_NO_LIB' is defined [-Winvalid-pch]
  576. [ 47%] Building CXX object src/server/scripts/CMakeFiles/scripts.dir/EasternKingdoms/BlackrockMountain/MoltenCore/boss_shazzrah.cpp.o
  577. cc1plus: warning: /home/grad/TBC_New/build/src/server/scripts/cotire/scripts_CXX_prefix.hxx.gch: not used because `BOOST_ALL_NO_LIB' is defined [-Winvalid-pch]
  578. [ 47%] Building CXX object src/server/scripts/CMakeFiles/scripts.dir/EasternKingdoms/BlackrockMountain/MoltenCore/boss_sulfuron_harbinger.cpp.o
  579. cc1plus: warning: /home/grad/TBC_New/build/src/server/scripts/cotire/scripts_CXX_prefix.hxx.gch: not used because `BOOST_ALL_NO_LIB' is defined [-Winvalid-pch]
  580. [ 47%] Building CXX object src/server/scripts/CMakeFiles/scripts.dir/EasternKingdoms/BlackrockMountain/MoltenCore/instance_molten_core.cpp.o
  581. cc1plus: warning: /home/grad/TBC_New/build/src/server/scripts/cotire/scripts_CXX_prefix.hxx.gch: not used because `BOOST_ALL_NO_LIB' is defined [-Winvalid-pch]
  582. [ 47%] Building CXX object src/server/scripts/CMakeFiles/scripts.dir/EasternKingdoms/Deadmines/boss_mr_smite.cpp.o
  583. cc1plus: warning: /home/grad/TBC_New/build/src/server/scripts/cotire/scripts_CXX_prefix.hxx.gch: not used because `BOOST_ALL_NO_LIB' is defined [-Winvalid-pch]
  584. [ 47%] Building CXX object src/server/scripts/CMakeFiles/scripts.dir/EasternKingdoms/Deadmines/boss_vancleef.cpp.o
  585. cc1plus: warning: /home/grad/TBC_New/build/src/server/scripts/cotire/scripts_CXX_prefix.hxx.gch: not used because `BOOST_ALL_NO_LIB' is defined [-Winvalid-pch]
  586. [ 47%] Building CXX object src/server/scripts/CMakeFiles/scripts.dir/EasternKingdoms/Deadmines/deadmines.cpp.o
  587. [ 47%] Building CXX object src/server/scripts/CMakeFiles/scripts.dir/EasternKingdoms/Deadmines/instance_deadmines.cpp.o
  588. cc1plus: warning: /home/grad/TBC_New/build/src/server/scripts/cotire/scripts_CXX_prefix.hxx.gch: not used because `BOOST_ALL_NO_LIB' is defined [-Winvalid-pch]
  589. cc1plus: warning: /home/grad/TBC_New/build/src/server/scripts/cotire/scripts_CXX_prefix.hxx.gch: not used because `BOOST_ALL_NO_LIB' is defined [-Winvalid-pch]
  590. [ 47%] Building CXX object src/server/scripts/CMakeFiles/scripts.dir/EasternKingdoms/Gnomeregan/gnomeregan.cpp.o
  591. cc1plus: warning: /home/grad/TBC_New/build/src/server/scripts/cotire/scripts_CXX_prefix.hxx.gch: not used because `BOOST_ALL_NO_LIB' is defined [-Winvalid-pch]
  592. [ 48%] Building CXX object src/server/scripts/CMakeFiles/scripts.dir/EasternKingdoms/Gnomeregan/instance_gnomeregan.cpp.o
  593. cc1plus: warning: /home/grad/TBC_New/build/src/server/scripts/cotire/scripts_CXX_prefix.hxx.gch: not used because `BOOST_ALL_NO_LIB' is defined [-Winvalid-pch]
  594. [ 48%] Building CXX object src/server/scripts/CMakeFiles/scripts.dir/EasternKingdoms/Karazhan/boss_curator.cpp.o
  595. cc1plus: warning: /home/grad/TBC_New/build/src/server/scripts/cotire/scripts_CXX_prefix.hxx.gch: not used because `BOOST_ALL_NO_LIB' is defined [-Winvalid-pch]
  596. [ 48%] Building CXX object src/server/scripts/CMakeFiles/scripts.dir/EasternKingdoms/Karazhan/boss_maiden_of_virtue.cpp.o
  597. cc1plus: warning: /home/grad/TBC_New/build/src/server/scripts/cotire/scripts_CXX_prefix.hxx.gch: not used because `BOOST_ALL_NO_LIB' is defined [-Winvalid-pch]
  598. [ 48%] Building CXX object src/server/scripts/CMakeFiles/scripts.dir/EasternKingdoms/Karazhan/boss_midnight.cpp.o
  599. cc1plus: warning: /home/grad/TBC_New/build/src/server/scripts/cotire/scripts_CXX_prefix.hxx.gch: not used because `BOOST_ALL_NO_LIB' is defined [-Winvalid-pch]
  600. [ 48%] Building CXX object src/server/scripts/CMakeFiles/scripts.dir/EasternKingdoms/Karazhan/boss_moroes.cpp.o
  601. cc1plus: warning: /home/grad/TBC_New/build/src/server/scripts/cotire/scripts_CXX_prefix.hxx.gch: not used because `BOOST_ALL_NO_LIB' is defined [-Winvalid-pch]
  602. [ 48%] Building CXX object src/server/scripts/CMakeFiles/scripts.dir/EasternKingdoms/Karazhan/boss_netherspite.cpp.o
  603. cc1plus: warning: /home/grad/TBC_New/build/src/server/scripts/cotire/scripts_CXX_prefix.hxx.gch: not used because `BOOST_ALL_NO_LIB' is defined [-Winvalid-pch]
  604. [ 48%] Building CXX object src/server/scripts/CMakeFiles/scripts.dir/EasternKingdoms/Karazhan/boss_nightbane.cpp.o
  605. cc1plus: warning: /home/grad/TBC_New/build/src/server/scripts/cotire/scripts_CXX_prefix.hxx.gch: not used because `BOOST_ALL_NO_LIB' is defined [-Winvalid-pch]
  606. [ 48%] Building CXX object src/server/scripts/CMakeFiles/scripts.dir/EasternKingdoms/Karazhan/boss_prince_malchezaar.cpp.o
  607. cc1plus: warning: /home/grad/TBC_New/build/src/server/scripts/cotire/scripts_CXX_prefix.hxx.gch: not used because `BOOST_ALL_NO_LIB' is defined [-Winvalid-pch]
  608. [ 48%] Building CXX object src/server/scripts/CMakeFiles/scripts.dir/EasternKingdoms/Karazhan/boss_shade_of_aran.cpp.o
  609. cc1plus: warning: /home/grad/TBC_New/build/src/server/scripts/cotire/scripts_CXX_prefix.hxx.gch: not used because `BOOST_ALL_NO_LIB' is defined [-Winvalid-pch]
  610. [ 49%] Building CXX object src/server/scripts/CMakeFiles/scripts.dir/EasternKingdoms/Karazhan/boss_terestian_illhoof.cpp.o
  611. cc1plus: warning: /home/grad/TBC_New/build/src/server/scripts/cotire/scripts_CXX_prefix.hxx.gch: not used because `BOOST_ALL_NO_LIB' is defined [-Winvalid-pch]
  612. [ 49%] Building CXX object src/server/scripts/CMakeFiles/scripts.dir/EasternKingdoms/Karazhan/bosses_opera.cpp.o
  613. cc1plus: warning: /home/grad/TBC_New/build/src/server/scripts/cotire/scripts_CXX_prefix.hxx.gch: not used because `BOOST_ALL_NO_LIB' is defined [-Winvalid-pch]
  614. [ 49%] Building CXX object src/server/scripts/CMakeFiles/scripts.dir/EasternKingdoms/Karazhan/instance_karazhan.cpp.o
  615. cc1plus: warning: /home/grad/TBC_New/build/src/server/scripts/cotire/scripts_CXX_prefix.hxx.gch: not used because `BOOST_ALL_NO_LIB' is defined [-Winvalid-pch]
  616. [ 49%] Building CXX object src/server/scripts/CMakeFiles/scripts.dir/EasternKingdoms/Karazhan/karazhan.cpp.o
  617. cc1plus: warning: /home/grad/TBC_New/build/src/server/scripts/cotire/scripts_CXX_prefix.hxx.gch: not used because `BOOST_ALL_NO_LIB' is defined [-Winvalid-pch]
  618. [ 49%] Building CXX object src/server/scripts/CMakeFiles/scripts.dir/EasternKingdoms/Karazhan/karazhan_chess_event.cpp.o
  619. cc1plus: warning: /home/grad/TBC_New/build/src/server/scripts/cotire/scripts_CXX_prefix.hxx.gch: not used because `BOOST_ALL_NO_LIB' is defined [-Winvalid-pch]
  620. [ 49%] Building CXX object src/server/scripts/CMakeFiles/scripts.dir/EasternKingdoms/MagistersTerrace/boss_felblood_kaelthas.cpp.o
  621. cc1plus: warning: /home/grad/TBC_New/build/src/server/scripts/cotire/scripts_CXX_prefix.hxx.gch: not used because `BOOST_ALL_NO_LIB' is defined [-Winvalid-pch]
  622. [ 49%] Building CXX object src/server/scripts/CMakeFiles/scripts.dir/EasternKingdoms/MagistersTerrace/boss_priestess_delrissa.cpp.o
  623. cc1plus: warning: /home/grad/TBC_New/build/src/server/scripts/cotire/scripts_CXX_prefix.hxx.gch: not used because `BOOST_ALL_NO_LIB' is defined [-Winvalid-pch]
  624. [ 49%] Building CXX object src/server/scripts/CMakeFiles/scripts.dir/EasternKingdoms/MagistersTerrace/boss_selin_fireheart.cpp.o
  625. cc1plus: warning: /home/grad/TBC_New/build/src/server/scripts/cotire/scripts_CXX_prefix.hxx.gch: not used because `BOOST_ALL_NO_LIB' is defined [-Winvalid-pch]
  626. [ 50%] Building CXX object src/server/scripts/CMakeFiles/scripts.dir/EasternKingdoms/MagistersTerrace/boss_vexallus.cpp.o
  627. cc1plus: warning: /home/grad/TBC_New/build/src/server/scripts/cotire/scripts_CXX_prefix.hxx.gch: not used because `BOOST_ALL_NO_LIB' is defined [-Winvalid-pch]
  628. [ 50%] Building CXX object src/server/scripts/CMakeFiles/scripts.dir/EasternKingdoms/MagistersTerrace/instance_magisters_terrace.cpp.o
  629. cc1plus: warning: /home/grad/TBC_New/build/src/server/scripts/cotire/scripts_CXX_prefix.hxx.gch: not used because `BOOST_ALL_NO_LIB' is defined [-Winvalid-pch]
  630. [ 50%] Building CXX object src/server/scripts/CMakeFiles/scripts.dir/EasternKingdoms/ScarletMonastery/boss_arcanist_doan.cpp.o
  631. cc1plus: warning: /home/grad/TBC_New/build/src/server/scripts/cotire/scripts_CXX_prefix.hxx.gch: not used because `BOOST_ALL_NO_LIB' is defined [-Winvalid-pch]
  632. [ 50%] Building CXX object src/server/scripts/CMakeFiles/scripts.dir/EasternKingdoms/ScarletMonastery/boss_azshir_the_sleepless.cpp.o
  633. [ 50%] Building CXX object src/server/scripts/CMakeFiles/scripts.dir/EasternKingdoms/ScarletMonastery/boss_bloodmage_thalnos.cpp.o
  634. cc1plus: warning: /home/grad/TBC_New/build/src/server/scripts/cotire/scripts_CXX_prefix.hxx.gch: not used because `BOOST_ALL_NO_LIB' is defined [-Winvalid-pch]
  635. cc1plus: warning: /home/grad/TBC_New/build/src/server/scripts/cotire/scripts_CXX_prefix.hxx.gch: not used because `BOOST_ALL_NO_LIB' is defined [-Winvalid-pch]
  636. [ 50%] Building CXX object src/server/scripts/CMakeFiles/scripts.dir/EasternKingdoms/ScarletMonastery/boss_headless_horseman.cpp.o
  637. cc1plus: warning: /home/grad/TBC_New/build/src/server/scripts/cotire/scripts_CXX_prefix.hxx.gch: not used because `BOOST_ALL_NO_LIB' is defined [-Winvalid-pch]
  638. [ 50%] Building CXX object src/server/scripts/CMakeFiles/scripts.dir/EasternKingdoms/ScarletMonastery/boss_herod.cpp.o
  639. cc1plus: warning: /home/grad/TBC_New/build/src/server/scripts/cotire/scripts_CXX_prefix.hxx.gch: not used because `BOOST_ALL_NO_LIB' is defined [-Winvalid-pch]
  640. [ 50%] Building CXX object src/server/scripts/CMakeFiles/scripts.dir/EasternKingdoms/ScarletMonastery/boss_high_inquisitor_fairbanks.cpp.o
  641. cc1plus: warning: /home/grad/TBC_New/build/src/server/scripts/cotire/scripts_CXX_prefix.hxx.gch: not used because `BOOST_ALL_NO_LIB' is defined [-Winvalid-pch]
  642. [ 51%] Building CXX object src/server/scripts/CMakeFiles/scripts.dir/EasternKingdoms/ScarletMonastery/boss_houndmaster_loksey.cpp.o
  643. cc1plus: warning: /home/grad/TBC_New/build/src/server/scripts/cotire/scripts_CXX_prefix.hxx.gch: not used because `BOOST_ALL_NO_LIB' is defined [-Winvalid-pch]
  644. [ 51%] Building CXX object src/server/scripts/CMakeFiles/scripts.dir/EasternKingdoms/ScarletMonastery/boss_interrogator_vishas.cpp.o
  645. cc1plus: warning: /home/grad/TBC_New/build/src/server/scripts/cotire/scripts_CXX_prefix.hxx.gch: not used because `BOOST_ALL_NO_LIB' is defined [-Winvalid-pch]
  646. [ 51%] Building CXX object src/server/scripts/CMakeFiles/scripts.dir/EasternKingdoms/ScarletMonastery/boss_mograine_and_whitemane.cpp.o
  647. cc1plus: warning: /home/grad/TBC_New/build/src/server/scripts/cotire/scripts_CXX_prefix.hxx.gch: not used because `BOOST_ALL_NO_LIB' is defined [-Winvalid-pch]
  648. [ 51%] Building CXX object src/server/scripts/CMakeFiles/scripts.dir/EasternKingdoms/ScarletMonastery/boss_scorn.cpp.o
  649. cc1plus: warning: /home/grad/TBC_New/build/src/server/scripts/cotire/scripts_CXX_prefix.hxx.gch: not used because `BOOST_ALL_NO_LIB' is defined [-Winvalid-pch]
  650. [ 51%] Building CXX object src/server/scripts/CMakeFiles/scripts.dir/EasternKingdoms/ScarletMonastery/instance_scarlet_monastery.cpp.o
  651. cc1plus: warning: /home/grad/TBC_New/build/src/server/scripts/cotire/scripts_CXX_prefix.hxx.gch: not used because `BOOST_ALL_NO_LIB' is defined [-Winvalid-pch]
  652. [ 51%] Building CXX object src/server/scripts/CMakeFiles/scripts.dir/EasternKingdoms/Scholomance/boss_darkmaster_gandling.cpp.o
  653. cc1plus: warning: /home/grad/TBC_New/build/src/server/scripts/cotire/scripts_CXX_prefix.hxx.gch: not used because `BOOST_ALL_NO_LIB' is defined [-Winvalid-pch]
  654. [ 51%] Building CXX object src/server/scripts/CMakeFiles/scripts.dir/EasternKingdoms/Scholomance/boss_death_knight_darkreaver.cpp.o
  655. cc1plus: warning: /home/grad/TBC_New/build/src/server/scripts/cotire/scripts_CXX_prefix.hxx.gch: not used because `BOOST_ALL_NO_LIB' is defined [-Winvalid-pch]
  656. [ 51%] Building CXX object src/server/scripts/CMakeFiles/scripts.dir/EasternKingdoms/Scholomance/boss_doctor_theolen_krastinov.cpp.o
  657. cc1plus: warning: /home/grad/TBC_New/build/src/server/scripts/cotire/scripts_CXX_prefix.hxx.gch: not used because `BOOST_ALL_NO_LIB' is defined [-Winvalid-pch]
  658. [ 51%] Building CXX object src/server/scripts/CMakeFiles/scripts.dir/EasternKingdoms/Scholomance/boss_illucia_barov.cpp.o
  659. cc1plus: warning: /home/grad/TBC_New/build/src/server/scripts/cotire/scripts_CXX_prefix.hxx.gch: not used because `BOOST_ALL_NO_LIB' is defined [-Winvalid-pch]
  660. [ 52%] Building CXX object src/server/scripts/CMakeFiles/scripts.dir/EasternKingdoms/Scholomance/boss_instructor_malicia.cpp.o
  661. cc1plus: warning: /home/grad/TBC_New/build/src/server/scripts/cotire/scripts_CXX_prefix.hxx.gch: not used because `BOOST_ALL_NO_LIB' is defined [-Winvalid-pch]
  662. [ 52%] Building CXX object src/server/scripts/CMakeFiles/scripts.dir/EasternKingdoms/Scholomance/boss_jandice_barov.cpp.o
  663. cc1plus: warning: /home/grad/TBC_New/build/src/server/scripts/cotire/scripts_CXX_prefix.hxx.gch: not used because `BOOST_ALL_NO_LIB' is defined [-Winvalid-pch]
  664. [ 52%] Building CXX object src/server/scripts/CMakeFiles/scripts.dir/EasternKingdoms/Scholomance/boss_kirtonos_the_herald.cpp.o
  665. cc1plus: warning: /home/grad/TBC_New/build/src/server/scripts/cotire/scripts_CXX_prefix.hxx.gch: not used because `BOOST_ALL_NO_LIB' is defined [-Winvalid-pch]
  666. [ 52%] Building CXX object src/server/scripts/CMakeFiles/scripts.dir/EasternKingdoms/Scholomance/boss_kormok.cpp.o
  667. cc1plus: warning: /home/grad/TBC_New/build/src/server/scripts/cotire/scripts_CXX_prefix.hxx.gch: not used because `BOOST_ALL_NO_LIB' is defined [-Winvalid-pch]
  668. [ 52%] Building CXX object src/server/scripts/CMakeFiles/scripts.dir/EasternKingdoms/Scholomance/boss_lord_alexei_barov.cpp.o
  669. cc1plus: warning: /home/grad/TBC_New/build/src/server/scripts/cotire/scripts_CXX_prefix.hxx.gch: not used because `BOOST_ALL_NO_LIB' is defined [-Winvalid-pch]
  670. [ 52%] Building CXX object src/server/scripts/CMakeFiles/scripts.dir/EasternKingdoms/Scholomance/boss_lorekeeper_polkelt.cpp.o
  671. cc1plus: warning: /home/grad/TBC_New/build/src/server/scripts/cotire/scripts_CXX_prefix.hxx.gch: not used because `BOOST_ALL_NO_LIB' is defined [-Winvalid-pch]
  672. [ 52%] Building CXX object src/server/scripts/CMakeFiles/scripts.dir/EasternKingdoms/Scholomance/boss_ras_frostwhisper.cpp.o
  673. cc1plus: warning: /home/grad/TBC_New/build/src/server/scripts/cotire/scripts_CXX_prefix.hxx.gch: not used because `BOOST_ALL_NO_LIB' is defined [-Winvalid-pch]
  674. [ 52%] Building CXX object src/server/scripts/CMakeFiles/scripts.dir/EasternKingdoms/Scholomance/boss_the_ravenian.cpp.o
  675. cc1plus: warning: /home/grad/TBC_New/build/src/server/scripts/cotire/scripts_CXX_prefix.hxx.gch: not used because `BOOST_ALL_NO_LIB' is defined [-Winvalid-pch]
  676. [ 53%] Building CXX object src/server/scripts/CMakeFiles/scripts.dir/EasternKingdoms/Scholomance/boss_vectus.cpp.o
  677. cc1plus: warning: /home/grad/TBC_New/build/src/server/scripts/cotire/scripts_CXX_prefix.hxx.gch: not used because `BOOST_ALL_NO_LIB' is defined [-Winvalid-pch]
  678. [ 53%] Building CXX object src/server/scripts/CMakeFiles/scripts.dir/EasternKingdoms/Scholomance/instance_scholomance.cpp.o
  679. cc1plus: warning: /home/grad/TBC_New/build/src/server/scripts/cotire/scripts_CXX_prefix.hxx.gch: not used because `BOOST_ALL_NO_LIB' is defined [-Winvalid-pch]
  680. [ 53%] Building CXX object src/server/scripts/CMakeFiles/scripts.dir/EasternKingdoms/ShadowfangKeep/instance_shadowfang_keep.cpp.o
  681. cc1plus: warning: /home/grad/TBC_New/build/src/server/scripts/cotire/scripts_CXX_prefix.hxx.gch: not used because `BOOST_ALL_NO_LIB' is defined [-Winvalid-pch]
  682. [ 53%] Building CXX object src/server/scripts/CMakeFiles/scripts.dir/EasternKingdoms/ShadowfangKeep/shadowfang_keep.cpp.o
  683. cc1plus: warning: /home/grad/TBC_New/build/src/server/scripts/cotire/scripts_CXX_prefix.hxx.gch: not used because `BOOST_ALL_NO_LIB' is defined [-Winvalid-pch]
  684. [ 53%] Building CXX object src/server/scripts/CMakeFiles/scripts.dir/EasternKingdoms/Stratholme/boss_baron_rivendare.cpp.o
  685. cc1plus: warning: /home/grad/TBC_New/build/src/server/scripts/cotire/scripts_CXX_prefix.hxx.gch: not used because `BOOST_ALL_NO_LIB' is defined [-Winvalid-pch]
  686. [ 53%] Building CXX object src/server/scripts/CMakeFiles/scripts.dir/EasternKingdoms/Stratholme/boss_baroness_anastari.cpp.o
  687. cc1plus: warning: /home/grad/TBC_New/build/src/server/scripts/cotire/scripts_CXX_prefix.hxx.gch: not used because `BOOST_ALL_NO_LIB' is defined [-Winvalid-pch]
  688. [ 53%] Building CXX object src/server/scripts/CMakeFiles/scripts.dir/EasternKingdoms/Stratholme/boss_cannon_master_willey.cpp.o
  689. cc1plus: warning: /home/grad/TBC_New/build/src/server/scripts/cotire/scripts_CXX_prefix.hxx.gch: not used because `BOOST_ALL_NO_LIB' is defined [-Winvalid-pch]
  690. [ 53%] Building CXX object src/server/scripts/CMakeFiles/scripts.dir/EasternKingdoms/Stratholme/boss_dathrohan_balnazzar.cpp.o
  691. cc1plus: warning: /home/grad/TBC_New/build/src/server/scripts/cotire/scripts_CXX_prefix.hxx.gch: not used because `BOOST_ALL_NO_LIB' is defined [-Winvalid-pch]
  692. [ 53%] Building CXX object src/server/scripts/CMakeFiles/scripts.dir/EasternKingdoms/Stratholme/boss_magistrate_barthilas.cpp.o
  693. cc1plus: warning: /home/grad/TBC_New/build/src/server/scripts/cotire/scripts_CXX_prefix.hxx.gch: not used because `BOOST_ALL_NO_LIB' is defined [-Winvalid-pch]
  694. [ 54%] Building CXX object src/server/scripts/CMakeFiles/scripts.dir/EasternKingdoms/Stratholme/boss_maleki_the_pallid.cpp.o
  695. cc1plus: warning: /home/grad/TBC_New/build/src/server/scripts/cotire/scripts_CXX_prefix.hxx.gch: not used because `BOOST_ALL_NO_LIB' is defined [-Winvalid-pch]
  696. [ 54%] Building CXX object src/server/scripts/CMakeFiles/scripts.dir/EasternKingdoms/Stratholme/boss_nerubenkan.cpp.o
  697. cc1plus: warning: /home/grad/TBC_New/build/src/server/scripts/cotire/scripts_CXX_prefix.hxx.gch: not used because `BOOST_ALL_NO_LIB' is defined [-Winvalid-pch]
  698. [ 54%] Building CXX object src/server/scripts/CMakeFiles/scripts.dir/EasternKingdoms/Stratholme/boss_order_of_silver_hand.cpp.o
  699. cc1plus: warning: /home/grad/TBC_New/build/src/server/scripts/cotire/scripts_CXX_prefix.hxx.gch: not used because `BOOST_ALL_NO_LIB' is defined [-Winvalid-pch]
  700. [ 54%] Building CXX object src/server/scripts/CMakeFiles/scripts.dir/EasternKingdoms/Stratholme/boss_postmaster_malown.cpp.o
  701. cc1plus: warning: /home/grad/TBC_New/build/src/server/scripts/cotire/scripts_CXX_prefix.hxx.gch: not used because `BOOST_ALL_NO_LIB' is defined [-Winvalid-pch]
  702. [ 54%] Building CXX object src/server/scripts/CMakeFiles/scripts.dir/EasternKingdoms/Stratholme/boss_ramstein_the_gorger.cpp.o
  703. cc1plus: warning: /home/grad/TBC_New/build/src/server/scripts/cotire/scripts_CXX_prefix.hxx.gch: not used because `BOOST_ALL_NO_LIB' is defined [-Winvalid-pch]
  704. [ 54%] Building CXX object src/server/scripts/CMakeFiles/scripts.dir/EasternKingdoms/Stratholme/boss_timmy_the_cruel.cpp.o
  705. cc1plus: warning: /home/grad/TBC_New/build/src/server/scripts/cotire/scripts_CXX_prefix.hxx.gch: not used because `BOOST_ALL_NO_LIB' is defined [-Winvalid-pch]
  706. [ 54%] Building CXX object src/server/scripts/CMakeFiles/scripts.dir/EasternKingdoms/Stratholme/instance_stratholme.cpp.o
  707. cc1plus: warning: /home/grad/TBC_New/build/src/server/scripts/cotire/scripts_CXX_prefix.hxx.gch: not used because `BOOST_ALL_NO_LIB' is defined [-Winvalid-pch]
  708. [ 54%] Building CXX object src/server/scripts/CMakeFiles/scripts.dir/EasternKingdoms/Stratholme/stratholme.cpp.o
  709. cc1plus: warning: /home/grad/TBC_New/build/src/server/scripts/cotire/scripts_CXX_prefix.hxx.gch: not used because `BOOST_ALL_NO_LIB' is defined [-Winvalid-pch]
  710. [ 55%] Building CXX object src/server/scripts/CMakeFiles/scripts.dir/EasternKingdoms/SunkenTemple/instance_sunken_temple.cpp.o
  711. cc1plus: warning: /home/grad/TBC_New/build/src/server/scripts/cotire/scripts_CXX_prefix.hxx.gch: not used because `BOOST_ALL_NO_LIB' is defined [-Winvalid-pch]
  712. [ 55%] Building CXX object src/server/scripts/CMakeFiles/scripts.dir/EasternKingdoms/SunkenTemple/sunken_temple.cpp.o
  713. cc1plus: warning: /home/grad/TBC_New/build/src/server/scripts/cotire/scripts_CXX_prefix.hxx.gch: not used because `BOOST_ALL_NO_LIB' is defined [-Winvalid-pch]
  714. [ 55%] Building CXX object src/server/scripts/CMakeFiles/scripts.dir/EasternKingdoms/SunwellPlateau/boss_brutallus.cpp.o
  715. cc1plus: warning: /home/grad/TBC_New/build/src/server/scripts/cotire/scripts_CXX_prefix.hxx.gch: not used because `BOOST_ALL_NO_LIB' is defined [-Winvalid-pch]
  716. [ 55%] Building CXX object src/server/scripts/CMakeFiles/scripts.dir/EasternKingdoms/SunwellPlateau/boss_eredar_twins.cpp.o
  717. cc1plus: warning: /home/grad/TBC_New/build/src/server/scripts/cotire/scripts_CXX_prefix.hxx.gch: not used because `BOOST_ALL_NO_LIB' is defined [-Winvalid-pch]
  718. [ 55%] Building CXX object src/server/scripts/CMakeFiles/scripts.dir/EasternKingdoms/SunwellPlateau/boss_felmyst.cpp.o
  719. cc1plus: warning: /home/grad/TBC_New/build/src/server/scripts/cotire/scripts_CXX_prefix.hxx.gch: not used because `BOOST_ALL_NO_LIB' is defined [-Winvalid-pch]
  720. [ 55%] Building CXX object src/server/scripts/CMakeFiles/scripts.dir/EasternKingdoms/SunwellPlateau/boss_kalecgos.cpp.o
  721. cc1plus: warning: /home/grad/TBC_New/build/src/server/scripts/cotire/scripts_CXX_prefix.hxx.gch: not used because `BOOST_ALL_NO_LIB' is defined [-Winvalid-pch]
  722. [ 55%] Building CXX object src/server/scripts/CMakeFiles/scripts.dir/EasternKingdoms/SunwellPlateau/boss_kiljaeden.cpp.o
  723. cc1plus: warning: /home/grad/TBC_New/build/src/server/scripts/cotire/scripts_CXX_prefix.hxx.gch: not used because `BOOST_ALL_NO_LIB' is defined [-Winvalid-pch]
  724. [ 55%] Building CXX object src/server/scripts/CMakeFiles/scripts.dir/EasternKingdoms/SunwellPlateau/boss_muru.cpp.o
  725. cc1plus: warning: /home/grad/TBC_New/build/src/server/scripts/cotire/scripts_CXX_prefix.hxx.gch: not used because `BOOST_ALL_NO_LIB' is defined [-Winvalid-pch]
  726. [ 55%] Building CXX object src/server/scripts/CMakeFiles/scripts.dir/EasternKingdoms/SunwellPlateau/instance_sunwell_plateau.cpp.o
  727. cc1plus: warning: /home/grad/TBC_New/build/src/server/scripts/cotire/scripts_CXX_prefix.hxx.gch: not used because `BOOST_ALL_NO_LIB' is defined [-Winvalid-pch]
  728. [ 56%] Building CXX object src/server/scripts/CMakeFiles/scripts.dir/EasternKingdoms/TheStockade/instance_the_stockade.cpp.o
  729. cc1plus: warning: /home/grad/TBC_New/build/src/server/scripts/cotire/scripts_CXX_prefix.hxx.gch: not used because `BOOST_ALL_NO_LIB' is defined [-Winvalid-pch]
  730. [ 56%] Building CXX object src/server/scripts/CMakeFiles/scripts.dir/EasternKingdoms/Uldaman/boss_archaedas.cpp.o
  731. cc1plus: warning: /home/grad/TBC_New/build/src/server/scripts/cotire/scripts_CXX_prefix.hxx.gch: not used because `BOOST_ALL_NO_LIB' is defined [-Winvalid-pch]
  732. [ 56%] Building CXX object src/server/scripts/CMakeFiles/scripts.dir/EasternKingdoms/Uldaman/boss_ironaya.cpp.o
  733. cc1plus: warning: /home/grad/TBC_New/build/src/server/scripts/cotire/scripts_CXX_prefix.hxx.gch: not used because `BOOST_ALL_NO_LIB' is defined [-Winvalid-pch]
  734. [ 56%] Building CXX object src/server/scripts/CMakeFiles/scripts.dir/EasternKingdoms/Uldaman/instance_uldaman.cpp.o
  735. cc1plus: warning: /home/grad/TBC_New/build/src/server/scripts/cotire/scripts_CXX_prefix.hxx.gch: not used because `BOOST_ALL_NO_LIB' is defined [-Winvalid-pch]
  736. [ 56%] Building CXX object src/server/scripts/CMakeFiles/scripts.dir/EasternKingdoms/Uldaman/uldaman.cpp.o
  737. cc1plus: warning: /home/grad/TBC_New/build/src/server/scripts/cotire/scripts_CXX_prefix.hxx.gch: not used because `BOOST_ALL_NO_LIB' is defined [-Winvalid-pch]
  738. [ 56%] Building CXX object src/server/scripts/CMakeFiles/scripts.dir/EasternKingdoms/ZulAman/boss_akilzon.cpp.o
  739. cc1plus: warning: /home/grad/TBC_New/build/src/server/scripts/cotire/scripts_CXX_prefix.hxx.gch: not used because `BOOST_ALL_NO_LIB' is defined [-Winvalid-pch]
  740. [ 56%] Building CXX object src/server/scripts/CMakeFiles/scripts.dir/EasternKingdoms/ZulAman/boss_halazzi.cpp.o
  741. cc1plus: warning: /home/grad/TBC_New/build/src/server/scripts/cotire/scripts_CXX_prefix.hxx.gch: not used because `BOOST_ALL_NO_LIB' is defined [-Winvalid-pch]
  742. [ 56%] Building CXX object src/server/scripts/CMakeFiles/scripts.dir/EasternKingdoms/ZulAman/boss_hexlord.cpp.o
  743. cc1plus: warning: /home/grad/TBC_New/build/src/server/scripts/cotire/scripts_CXX_prefix.hxx.gch: not used because `BOOST_ALL_NO_LIB' is defined [-Winvalid-pch]
  744. [ 57%] Building CXX object src/server/scripts/CMakeFiles/scripts.dir/EasternKingdoms/ZulAman/boss_janalai.cpp.o
  745. cc1plus: warning: /home/grad/TBC_New/build/src/server/scripts/cotire/scripts_CXX_prefix.hxx.gch: not used because `BOOST_ALL_NO_LIB' is defined [-Winvalid-pch]
  746. [ 57%] Building CXX object src/server/scripts/CMakeFiles/scripts.dir/EasternKingdoms/ZulAman/boss_nalorakk.cpp.o
  747. cc1plus: warning: /home/grad/TBC_New/build/src/server/scripts/cotire/scripts_CXX_prefix.hxx.gch: not used because `BOOST_ALL_NO_LIB' is defined [-Winvalid-pch]
  748. [ 57%] Building CXX object src/server/scripts/CMakeFiles/scripts.dir/EasternKingdoms/ZulAman/boss_zuljin.cpp.o
  749. cc1plus: warning: /home/grad/TBC_New/build/src/server/scripts/cotire/scripts_CXX_prefix.hxx.gch: not used because `BOOST_ALL_NO_LIB' is defined [-Winvalid-pch]
  750. [ 57%] Building CXX object src/server/scripts/CMakeFiles/scripts.dir/EasternKingdoms/ZulAman/instance_zulaman.cpp.o
  751. cc1plus: warning: /home/grad/TBC_New/build/src/server/scripts/cotire/scripts_CXX_prefix.hxx.gch: not used because `BOOST_ALL_NO_LIB' is defined [-Winvalid-pch]
  752. [ 57%] Building CXX object src/server/scripts/CMakeFiles/scripts.dir/EasternKingdoms/ZulAman/zulaman.cpp.o
  753. cc1plus: warning: /home/grad/TBC_New/build/src/server/scripts/cotire/scripts_CXX_prefix.hxx.gch: not used because `BOOST_ALL_NO_LIB' is defined [-Winvalid-pch]
  754. [ 57%] Building CXX object src/server/scripts/CMakeFiles/scripts.dir/EasternKingdoms/ZulGurub/boss_arlokk.cpp.o
  755. cc1plus: warning: /home/grad/TBC_New/build/src/server/scripts/cotire/scripts_CXX_prefix.hxx.gch: not used because `BOOST_ALL_NO_LIB' is defined [-Winvalid-pch]
  756. [ 57%] Building CXX object src/server/scripts/CMakeFiles/scripts.dir/EasternKingdoms/ZulGurub/boss_gahzranka.cpp.o
  757. cc1plus: warning: /home/grad/TBC_New/build/src/server/scripts/cotire/scripts_CXX_prefix.hxx.gch: not used because `BOOST_ALL_NO_LIB' is defined [-Winvalid-pch]
  758. [ 57%] Building CXX object src/server/scripts/CMakeFiles/scripts.dir/EasternKingdoms/ZulGurub/boss_grilek.cpp.o
  759. cc1plus: warning: /home/grad/TBC_New/build/src/server/scripts/cotire/scripts_CXX_prefix.hxx.gch: not used because `BOOST_ALL_NO_LIB' is defined [-Winvalid-pch]
  760. [ 57%] Building CXX object src/server/scripts/CMakeFiles/scripts.dir/EasternKingdoms/ZulGurub/boss_hakkar.cpp.o
  761. cc1plus: warning: /home/grad/TBC_New/build/src/server/scripts/cotire/scripts_CXX_prefix.hxx.gch: not used because `BOOST_ALL_NO_LIB' is defined [-Winvalid-pch]
  762. [ 58%] Building CXX object src/server/scripts/CMakeFiles/scripts.dir/EasternKingdoms/ZulGurub/boss_hazzarah.cpp.o
  763. [ 58%] Building CXX object src/server/scripts/CMakeFiles/scripts.dir/EasternKingdoms/ZulGurub/boss_jeklik.cpp.o
  764. cc1plus: warning: /home/grad/TBC_New/build/src/server/scripts/cotire/scripts_CXX_prefix.hxx.gch: not used because `BOOST_ALL_NO_LIB' is defined [-Winvalid-pch]
  765. cc1plus: warning: /home/grad/TBC_New/build/src/server/scripts/cotire/scripts_CXX_prefix.hxx.gch: not used because `BOOST_ALL_NO_LIB' is defined [-Winvalid-pch]
  766. [ 58%] Building CXX object src/server/scripts/CMakeFiles/scripts.dir/EasternKingdoms/ZulGurub/boss_jindo.cpp.o
  767. cc1plus: warning: /home/grad/TBC_New/build/src/server/scripts/cotire/scripts_CXX_prefix.hxx.gch: not used because `BOOST_ALL_NO_LIB' is defined [-Winvalid-pch]
  768. [ 58%] Building CXX object src/server/scripts/CMakeFiles/scripts.dir/EasternKingdoms/ZulGurub/boss_mandokir.cpp.o
  769. cc1plus: warning: /home/grad/TBC_New/build/src/server/scripts/cotire/scripts_CXX_prefix.hxx.gch: not used because `BOOST_ALL_NO_LIB' is defined [-Winvalid-pch]
  770. [ 58%] Building CXX object src/server/scripts/CMakeFiles/scripts.dir/EasternKingdoms/ZulGurub/boss_marli.cpp.o
  771. cc1plus: warning: /home/grad/TBC_New/build/src/server/scripts/cotire/scripts_CXX_prefix.hxx.gch: not used because `BOOST_ALL_NO_LIB' is defined [-Winvalid-pch]
  772. [ 58%] Building CXX object src/server/scripts/CMakeFiles/scripts.dir/EasternKingdoms/ZulGurub/boss_renataki.cpp.o
  773. cc1plus: warning: /home/grad/TBC_New/build/src/server/scripts/cotire/scripts_CXX_prefix.hxx.gch: not used because `BOOST_ALL_NO_LIB' is defined [-Winvalid-pch]
  774. [ 58%] Building CXX object src/server/scripts/CMakeFiles/scripts.dir/EasternKingdoms/ZulGurub/boss_thekal.cpp.o
  775. cc1plus: warning: /home/grad/TBC_New/build/src/server/scripts/cotire/scripts_CXX_prefix.hxx.gch: not used because `BOOST_ALL_NO_LIB' is defined [-Winvalid-pch]
  776. [ 58%] Building CXX object src/server/scripts/CMakeFiles/scripts.dir/EasternKingdoms/ZulGurub/boss_venoxis.cpp.o
  777. cc1plus: warning: /home/grad/TBC_New/build/src/server/scripts/cotire/scripts_CXX_prefix.hxx.gch: not used because `BOOST_ALL_NO_LIB' is defined [-Winvalid-pch]
  778. [ 59%] Building CXX object src/server/scripts/CMakeFiles/scripts.dir/EasternKingdoms/ZulGurub/boss_wushoolay.cpp.o
  779. cc1plus: warning: /home/grad/TBC_New/build/src/server/scripts/cotire/scripts_CXX_prefix.hxx.gch: not used because `BOOST_ALL_NO_LIB' is defined [-Winvalid-pch]
  780. [ 59%] Building CXX object src/server/scripts/CMakeFiles/scripts.dir/EasternKingdoms/ZulGurub/instance_zulgurub.cpp.o
  781. cc1plus: warning: /home/grad/TBC_New/build/src/server/scripts/cotire/scripts_CXX_prefix.hxx.gch: not used because `BOOST_ALL_NO_LIB' is defined [-Winvalid-pch]
  782. [ 59%] Building CXX object src/server/scripts/CMakeFiles/scripts.dir/Events/childrens_week.cpp.o
  783. cc1plus: warning: /home/grad/TBC_New/build/src/server/scripts/cotire/scripts_CXX_prefix.hxx.gch: not used because `BOOST_ALL_NO_LIB' is defined [-Winvalid-pch]
  784. [ 59%] Building CXX object src/server/scripts/CMakeFiles/scripts.dir/Events/events_script_loader.cpp.o
  785. cc1plus: warning: /home/grad/TBC_New/build/src/server/scripts/cotire/scripts_CXX_prefix.hxx.gch: not used because `BOOST_ALL_NO_LIB' is defined [-Winvalid-pch]
  786. [ 59%] Building CXX object src/server/scripts/CMakeFiles/scripts.dir/Events/fireworks_show.cpp.o
  787. cc1plus: warning: /home/grad/TBC_New/build/src/server/scripts/cotire/scripts_CXX_prefix.hxx.gch: not used because `BOOST_ALL_NO_LIB' is defined [-Winvalid-pch]
  788. [ 59%] Building CXX object src/server/scripts/CMakeFiles/scripts.dir/Kalimdor/boss_azuregos.cpp.o
  789. cc1plus: warning: /home/grad/TBC_New/build/src/server/scripts/cotire/scripts_CXX_prefix.hxx.gch: not used because `BOOST_ALL_NO_LIB' is defined [-Winvalid-pch]
  790. [ 59%] Building CXX object src/server/scripts/CMakeFiles/scripts.dir/Kalimdor/kalimdor_script_loader.cpp.o
  791. cc1plus: warning: /home/grad/TBC_New/build/src/server/scripts/cotire/scripts_CXX_prefix.hxx.gch: not used because `BOOST_ALL_NO_LIB' is defined [-Winvalid-pch]
  792. [ 59%] Building CXX object src/server/scripts/CMakeFiles/scripts.dir/Kalimdor/zone_ashenvale.cpp.o
  793. cc1plus: warning: /home/grad/TBC_New/build/src/server/scripts/cotire/scripts_CXX_prefix.hxx.gch: not used because `BOOST_ALL_NO_LIB' is defined [-Winvalid-pch]
  794. [ 59%] Building CXX object src/server/scripts/CMakeFiles/scripts.dir/Kalimdor/zone_azshara.cpp.o
  795. cc1plus: warning: /home/grad/TBC_New/build/src/server/scripts/cotire/scripts_CXX_prefix.hxx.gch: not used because `BOOST_ALL_NO_LIB' is defined [-Winvalid-pch]
  796. [ 60%] Building CXX object src/server/scripts/CMakeFiles/scripts.dir/Kalimdor/zone_azuremyst_isle.cpp.o
  797. cc1plus: warning: /home/grad/TBC_New/build/src/server/scripts/cotire/scripts_CXX_prefix.hxx.gch: not used because `BOOST_ALL_NO_LIB' is defined [-Winvalid-pch]
  798. [ 60%] Building CXX object src/server/scripts/CMakeFiles/scripts.dir/Kalimdor/zone_bloodmyst_isle.cpp.o
  799. cc1plus: warning: /home/grad/TBC_New/build/src/server/scripts/cotire/scripts_CXX_prefix.hxx.gch: not used because `BOOST_ALL_NO_LIB' is defined [-Winvalid-pch]
  800. [ 60%] Building CXX object src/server/scripts/CMakeFiles/scripts.dir/Kalimdor/zone_darkshore.cpp.o
  801. cc1plus: warning: /home/grad/TBC_New/build/src/server/scripts/cotire/scripts_CXX_prefix.hxx.gch: not used because `BOOST_ALL_NO_LIB' is defined [-Winvalid-pch]
  802. [ 60%] Building CXX object src/server/scripts/CMakeFiles/scripts.dir/Kalimdor/zone_desolace.cpp.o
  803. cc1plus: warning: /home/grad/TBC_New/build/src/server/scripts/cotire/scripts_CXX_prefix.hxx.gch: not used because `BOOST_ALL_NO_LIB' is defined [-Winvalid-pch]
  804. [ 60%] Building CXX object src/server/scripts/CMakeFiles/scripts.dir/Kalimdor/zone_durotar.cpp.o
  805. cc1plus: warning: /home/grad/TBC_New/build/src/server/scripts/cotire/scripts_CXX_prefix.hxx.gch: not used because `BOOST_ALL_NO_LIB' is defined [-Winvalid-pch]
  806. [ 60%] Building CXX object src/server/scripts/CMakeFiles/scripts.dir/Kalimdor/zone_dustwallow_marsh.cpp.o
  807. cc1plus: warning: /home/grad/TBC_New/build/src/server/scripts/cotire/scripts_CXX_prefix.hxx.gch: not used because `BOOST_ALL_NO_LIB' is defined [-Winvalid-pch]
  808. [ 60%] Building CXX object src/server/scripts/CMakeFiles/scripts.dir/Kalimdor/zone_felwood.cpp.o
  809. cc1plus: warning: /home/grad/TBC_New/build/src/server/scripts/cotire/scripts_CXX_prefix.hxx.gch: not used because `BOOST_ALL_NO_LIB' is defined [-Winvalid-pch]
  810. [ 60%] Building CXX object src/server/scripts/CMakeFiles/scripts.dir/Kalimdor/zone_feralas.cpp.o
  811. cc1plus: warning: /home/grad/TBC_New/build/src/server/scripts/cotire/scripts_CXX_prefix.hxx.gch: not used because `BOOST_ALL_NO_LIB' is defined [-Winvalid-pch]
  812. [ 61%] Building CXX object src/server/scripts/CMakeFiles/scripts.dir/Kalimdor/zone_moonglade.cpp.o
  813. cc1plus: warning: /home/grad/TBC_New/build/src/server/scripts/cotire/scripts_CXX_prefix.hxx.gch: not used because `BOOST_ALL_NO_LIB' is defined [-Winvalid-pch]
  814. [ 61%] Building CXX object src/server/scripts/CMakeFiles/scripts.dir/Kalimdor/zone_mulgore.cpp.o
  815. cc1plus: warning: /home/grad/TBC_New/build/src/server/scripts/cotire/scripts_CXX_prefix.hxx.gch: not used because `BOOST_ALL_NO_LIB' is defined [-Winvalid-pch]
  816. [ 61%] Building CXX object src/server/scripts/CMakeFiles/scripts.dir/Kalimdor/zone_orgrimmar.cpp.o
  817. cc1plus: warning: /home/grad/TBC_New/build/src/server/scripts/cotire/scripts_CXX_prefix.hxx.gch: not used because `BOOST_ALL_NO_LIB' is defined [-Winvalid-pch]
  818. [ 61%] Building CXX object src/server/scripts/CMakeFiles/scripts.dir/Kalimdor/zone_silithus.cpp.o
  819. cc1plus: warning: /home/grad/TBC_New/build/src/server/scripts/cotire/scripts_CXX_prefix.hxx.gch: not used because `BOOST_ALL_NO_LIB' is defined [-Winvalid-pch]
  820. [ 61%] Building CXX object src/server/scripts/CMakeFiles/scripts.dir/Kalimdor/zone_stonetalon_mountains.cpp.o
  821. cc1plus: warning: /home/grad/TBC_New/build/src/server/scripts/cotire/scripts_CXX_prefix.hxx.gch: not used because `BOOST_ALL_NO_LIB' is defined [-Winvalid-pch]
  822. [ 61%] Building CXX object src/server/scripts/CMakeFiles/scripts.dir/Kalimdor/zone_tanaris.cpp.o
  823. cc1plus: warning: /home/grad/TBC_New/build/src/server/scripts/cotire/scripts_CXX_prefix.hxx.gch: not used because `BOOST_ALL_NO_LIB' is defined [-Winvalid-pch]
  824. [ 61%] Building CXX object src/server/scripts/CMakeFiles/scripts.dir/Kalimdor/zone_teldrassil.cpp.o
  825. cc1plus: warning: /home/grad/TBC_New/build/src/server/scripts/cotire/scripts_CXX_prefix.hxx.gch: not used because `BOOST_ALL_NO_LIB' is defined [-Winvalid-pch]
  826. [ 61%] Building CXX object src/server/scripts/CMakeFiles/scripts.dir/Kalimdor/zone_the_barrens.cpp.o
  827. cc1plus: warning: /home/grad/TBC_New/build/src/server/scripts/cotire/scripts_CXX_prefix.hxx.gch: not used because `BOOST_ALL_NO_LIB' is defined [-Winvalid-pch]
  828. [ 61%] Building CXX object src/server/scripts/CMakeFiles/scripts.dir/Kalimdor/zone_thousand_needles.cpp.o
  829. cc1plus: warning: /home/grad/TBC_New/build/src/server/scripts/cotire/scripts_CXX_prefix.hxx.gch: not used because `BOOST_ALL_NO_LIB' is defined [-Winvalid-pch]
  830. [ 62%] Building CXX object src/server/scripts/CMakeFiles/scripts.dir/Kalimdor/zone_thunder_bluff.cpp.o
  831. cc1plus: warning: /home/grad/TBC_New/build/src/server/scripts/cotire/scripts_CXX_prefix.hxx.gch: not used because `BOOST_ALL_NO_LIB' is defined [-Winvalid-pch]
  832. [ 62%] Building CXX object src/server/scripts/CMakeFiles/scripts.dir/Kalimdor/zone_ungoro_crater.cpp.o
  833. cc1plus: warning: /home/grad/TBC_New/build/src/server/scripts/cotire/scripts_CXX_prefix.hxx.gch: not used because `BOOST_ALL_NO_LIB' is defined [-Winvalid-pch]
  834. [ 62%] Building CXX object src/server/scripts/CMakeFiles/scripts.dir/Kalimdor/zone_winterspring.cpp.o
  835. cc1plus: warning: /home/grad/TBC_New/build/src/server/scripts/cotire/scripts_CXX_prefix.hxx.gch: not used because `BOOST_ALL_NO_LIB' is defined [-Winvalid-pch]
  836. [ 62%] Building CXX object src/server/scripts/CMakeFiles/scripts.dir/Kalimdor/BlackfathomDeeps/blackfathom_deeps.cpp.o
  837. cc1plus: warning: /home/grad/TBC_New/build/src/server/scripts/cotire/scripts_CXX_prefix.hxx.gch: not used because `BOOST_ALL_NO_LIB' is defined [-Winvalid-pch]
  838. [ 62%] Building CXX object src/server/scripts/CMakeFiles/scripts.dir/Kalimdor/BlackfathomDeeps/boss_aku_mai.cpp.o
  839. cc1plus: warning: /home/grad/TBC_New/build/src/server/scripts/cotire/scripts_CXX_prefix.hxx.gch: not used because `BOOST_ALL_NO_LIB' is defined [-Winvalid-pch]
  840. [ 62%] Building CXX object src/server/scripts/CMakeFiles/scripts.dir/Kalimdor/BlackfathomDeeps/boss_gelihast.cpp.o
  841. cc1plus: warning: /home/grad/TBC_New/build/src/server/scripts/cotire/scripts_CXX_prefix.hxx.gch: not used because `BOOST_ALL_NO_LIB' is defined [-Winvalid-pch]
  842. [ 62%] Building CXX object src/server/scripts/CMakeFiles/scripts.dir/Kalimdor/BlackfathomDeeps/boss_kelris.cpp.o
  843. cc1plus: warning: /home/grad/TBC_New/build/src/server/scripts/cotire/scripts_CXX_prefix.hxx.gch: not used because `BOOST_ALL_NO_LIB' is defined [-Winvalid-pch]
  844. [ 62%] Building CXX object src/server/scripts/CMakeFiles/scripts.dir/Kalimdor/BlackfathomDeeps/instance_blackfathom_deeps.cpp.o
  845. cc1plus: warning: /home/grad/TBC_New/build/src/server/scripts/cotire/scripts_CXX_prefix.hxx.gch: not used because `BOOST_ALL_NO_LIB' is defined [-Winvalid-pch]
  846. [ 63%] Building CXX object src/server/scripts/CMakeFiles/scripts.dir/Kalimdor/CavernsOfTime/BattleForMountHyjal/boss_anetheron.cpp.o
  847. cc1plus: warning: /home/grad/TBC_New/build/src/server/scripts/cotire/scripts_CXX_prefix.hxx.gch: not used because `BOOST_ALL_NO_LIB' is defined [-Winvalid-pch]
  848. [ 63%] Building CXX object src/server/scripts/CMakeFiles/scripts.dir/Kalimdor/CavernsOfTime/BattleForMountHyjal/boss_archimonde.cpp.o
  849. cc1plus: warning: /home/grad/TBC_New/build/src/server/scripts/cotire/scripts_CXX_prefix.hxx.gch: not used because `BOOST_ALL_NO_LIB' is defined [-Winvalid-pch]
  850. [ 63%] Building CXX object src/server/scripts/CMakeFiles/scripts.dir/Kalimdor/CavernsOfTime/BattleForMountHyjal/boss_azgalor.cpp.o
  851. cc1plus: warning: /home/grad/TBC_New/build/src/server/scripts/cotire/scripts_CXX_prefix.hxx.gch: not used because `BOOST_ALL_NO_LIB' is defined [-Winvalid-pch]
  852. [ 63%] Building CXX object src/server/scripts/CMakeFiles/scripts.dir/Kalimdor/CavernsOfTime/BattleForMountHyjal/boss_kazrogal.cpp.o
  853. cc1plus: warning: /home/grad/TBC_New/build/src/server/scripts/cotire/scripts_CXX_prefix.hxx.gch: not used because `BOOST_ALL_NO_LIB' is defined [-Winvalid-pch]
  854. [ 63%] Building CXX object src/server/scripts/CMakeFiles/scripts.dir/Kalimdor/CavernsOfTime/BattleForMountHyjal/boss_rage_winterchill.cpp.o
  855. cc1plus: warning: /home/grad/TBC_New/build/src/server/scripts/cotire/scripts_CXX_prefix.hxx.gch: not used because `BOOST_ALL_NO_LIB' is defined [-Winvalid-pch]
  856. [ 63%] Building CXX object src/server/scripts/CMakeFiles/scripts.dir/Kalimdor/CavernsOfTime/BattleForMountHyjal/hyjal.cpp.o
  857. cc1plus: warning: /home/grad/TBC_New/build/src/server/scripts/cotire/scripts_CXX_prefix.hxx.gch: not used because `BOOST_ALL_NO_LIB' is defined [-Winvalid-pch]
  858. [ 63%] Building CXX object src/server/scripts/CMakeFiles/scripts.dir/Kalimdor/CavernsOfTime/BattleForMountHyjal/hyjalAI.cpp.o
  859. cc1plus: warning: /home/grad/TBC_New/build/src/server/scripts/cotire/scripts_CXX_prefix.hxx.gch: not used because `BOOST_ALL_NO_LIB' is defined [-Winvalid-pch]
  860. [ 63%] Building CXX object src/server/scripts/CMakeFiles/scripts.dir/Kalimdor/CavernsOfTime/BattleForMountHyjal/hyjal_trash.cpp.o
  861. cc1plus: warning: /home/grad/TBC_New/build/src/server/scripts/cotire/scripts_CXX_prefix.hxx.gch: not used because `BOOST_ALL_NO_LIB' is defined [-Winvalid-pch]
  862. [ 64%] Building CXX object src/server/scripts/CMakeFiles/scripts.dir/Kalimdor/CavernsOfTime/BattleForMountHyjal/instance_hyjal.cpp.o
  863. cc1plus: warning: /home/grad/TBC_New/build/src/server/scripts/cotire/scripts_CXX_prefix.hxx.gch: not used because `BOOST_ALL_NO_LIB' is defined [-Winvalid-pch]
  864. [ 64%] Building CXX object src/server/scripts/CMakeFiles/scripts.dir/Kalimdor/CavernsOfTime/EscapeFromDurnholdeKeep/boss_captain_skarloc.cpp.o
  865. cc1plus: warning: /home/grad/TBC_New/build/src/server/scripts/cotire/scripts_CXX_prefix.hxx.gch: not used because `BOOST_ALL_NO_LIB' is defined [-Winvalid-pch]
  866. [ 64%] Building CXX object src/server/scripts/CMakeFiles/scripts.dir/Kalimdor/CavernsOfTime/EscapeFromDurnholdeKeep/boss_epoch_hunter.cpp.o
  867. cc1plus: warning: /home/grad/TBC_New/build/src/server/scripts/cotire/scripts_CXX_prefix.hxx.gch: not used because `BOOST_ALL_NO_LIB' is defined [-Winvalid-pch]
  868. [ 64%] Building CXX object src/server/scripts/CMakeFiles/scripts.dir/Kalimdor/CavernsOfTime/EscapeFromDurnholdeKeep/boss_leutenant_drake.cpp.o
  869. cc1plus: warning: /home/grad/TBC_New/build/src/server/scripts/cotire/scripts_CXX_prefix.hxx.gch: not used because `BOOST_ALL_NO_LIB' is defined [-Winvalid-pch]
  870. [ 64%] Building CXX object src/server/scripts/CMakeFiles/scripts.dir/Kalimdor/CavernsOfTime/EscapeFromDurnholdeKeep/instance_old_hillsbrad.cpp.o
  871. cc1plus: warning: /home/grad/TBC_New/build/src/server/scripts/cotire/scripts_CXX_prefix.hxx.gch: not used because `BOOST_ALL_NO_LIB' is defined [-Winvalid-pch]
  872. [ 64%] Building CXX object src/server/scripts/CMakeFiles/scripts.dir/Kalimdor/CavernsOfTime/EscapeFromDurnholdeKeep/old_hillsbrad.cpp.o
  873. cc1plus: warning: /home/grad/TBC_New/build/src/server/scripts/cotire/scripts_CXX_prefix.hxx.gch: not used because `BOOST_ALL_NO_LIB' is defined [-Winvalid-pch]
  874. [ 64%] Building CXX object src/server/scripts/CMakeFiles/scripts.dir/Kalimdor/CavernsOfTime/TheBlackMorass/boss_aeonus.cpp.o
  875. cc1plus: warning: /home/grad/TBC_New/build/src/server/scripts/cotire/scripts_CXX_prefix.hxx.gch: not used because `BOOST_ALL_NO_LIB' is defined [-Winvalid-pch]
  876. [ 64%] Building CXX object src/server/scripts/CMakeFiles/scripts.dir/Kalimdor/CavernsOfTime/TheBlackMorass/boss_chrono_lord_deja.cpp.o
  877. cc1plus: warning: /home/grad/TBC_New/build/src/server/scripts/cotire/scripts_CXX_prefix.hxx.gch: not used because `BOOST_ALL_NO_LIB' is defined [-Winvalid-pch]
  878. [ 64%] Building CXX object src/server/scripts/CMakeFiles/scripts.dir/Kalimdor/CavernsOfTime/TheBlackMorass/boss_temporus.cpp.o
  879. cc1plus: warning: /home/grad/TBC_New/build/src/server/scripts/cotire/scripts_CXX_prefix.hxx.gch: not used because `BOOST_ALL_NO_LIB' is defined [-Winvalid-pch]
  880. [ 65%] Building CXX object src/server/scripts/CMakeFiles/scripts.dir/Kalimdor/CavernsOfTime/TheBlackMorass/instance_the_black_morass.cpp.o
  881. cc1plus: warning: /home/grad/TBC_New/build/src/server/scripts/cotire/scripts_CXX_prefix.hxx.gch: not used because `BOOST_ALL_NO_LIB' is defined [-Winvalid-pch]
  882. [ 65%] Building CXX object src/server/scripts/CMakeFiles/scripts.dir/Kalimdor/CavernsOfTime/TheBlackMorass/the_black_morass.cpp.o
  883. [ 65%] Building CXX object src/server/scripts/CMakeFiles/scripts.dir/Kalimdor/DireMaul/instance_dire_maul.cpp.o
  884. cc1plus: warning: /home/grad/TBC_New/build/src/server/scripts/cotire/scripts_CXX_prefix.hxx.gch: not used because `BOOST_ALL_NO_LIB' is defined [-Winvalid-pch]
  885. cc1plus: warning: /home/grad/TBC_New/build/src/server/scripts/cotire/scripts_CXX_prefix.hxx.gch: not used because `BOOST_ALL_NO_LIB' is defined [-Winvalid-pch]
  886. [ 65%] Building CXX object src/server/scripts/CMakeFiles/scripts.dir/Kalimdor/Maraudon/boss_celebras_the_cursed.cpp.o
  887. cc1plus: warning: /home/grad/TBC_New/build/src/server/scripts/cotire/scripts_CXX_prefix.hxx.gch: not used because `BOOST_ALL_NO_LIB' is defined [-Winvalid-pch]
  888. [ 65%] Building CXX object src/server/scripts/CMakeFiles/scripts.dir/Kalimdor/Maraudon/boss_landslide.cpp.o
  889. cc1plus: warning: /home/grad/TBC_New/build/src/server/scripts/cotire/scripts_CXX_prefix.hxx.gch: not used because `BOOST_ALL_NO_LIB' is defined [-Winvalid-pch]
  890. [ 65%] Building CXX object src/server/scripts/CMakeFiles/scripts.dir/Kalimdor/Maraudon/boss_noxxion.cpp.o
  891. cc1plus: warning: /home/grad/TBC_New/build/src/server/scripts/cotire/scripts_CXX_prefix.hxx.gch: not used because `BOOST_ALL_NO_LIB' is defined [-Winvalid-pch]
  892. [ 65%] Building CXX object src/server/scripts/CMakeFiles/scripts.dir/Kalimdor/Maraudon/boss_princess_theradras.cpp.o
  893. cc1plus: warning: /home/grad/TBC_New/build/src/server/scripts/cotire/scripts_CXX_prefix.hxx.gch: not used because `BOOST_ALL_NO_LIB' is defined [-Winvalid-pch]
  894. [ 65%] Building CXX object src/server/scripts/CMakeFiles/scripts.dir/Kalimdor/Maraudon/instance_maraudon.cpp.o
  895. cc1plus: warning: /home/grad/TBC_New/build/src/server/scripts/cotire/scripts_CXX_prefix.hxx.gch: not used because `BOOST_ALL_NO_LIB' is defined [-Winvalid-pch]
  896. [ 66%] Building CXX object src/server/scripts/CMakeFiles/scripts.dir/Kalimdor/OnyxiasLair/boss_onyxia.cpp.o
  897. cc1plus: warning: /home/grad/TBC_New/build/src/server/scripts/cotire/scripts_CXX_prefix.hxx.gch: not used because `BOOST_ALL_NO_LIB' is defined [-Winvalid-pch]
  898. [ 66%] Building CXX object src/server/scripts/CMakeFiles/scripts.dir/Kalimdor/OnyxiasLair/instance_onyxias_lair.cpp.o
  899. cc1plus: warning: /home/grad/TBC_New/build/src/server/scripts/cotire/scripts_CXX_prefix.hxx.gch: not used because `BOOST_ALL_NO_LIB' is defined [-Winvalid-pch]
  900. [ 66%] Building CXX object src/server/scripts/CMakeFiles/scripts.dir/Kalimdor/RagefireChasm/instance_ragefire_chasm.cpp.o
  901. cc1plus: warning: /home/grad/TBC_New/build/src/server/scripts/cotire/scripts_CXX_prefix.hxx.gch: not used because `BOOST_ALL_NO_LIB' is defined [-Winvalid-pch]
  902. [ 66%] Building CXX object src/server/scripts/CMakeFiles/scripts.dir/Kalimdor/RazorfenDowns/boss_amnennar_the_coldbringer.cpp.o
  903. cc1plus: warning: /home/grad/TBC_New/build/src/server/scripts/cotire/scripts_CXX_prefix.hxx.gch: not used because `BOOST_ALL_NO_LIB' is defined [-Winvalid-pch]
  904. [ 66%] Building CXX object src/server/scripts/CMakeFiles/scripts.dir/Kalimdor/RazorfenDowns/boss_glutton.cpp.o
  905. cc1plus: warning: /home/grad/TBC_New/build/src/server/scripts/cotire/scripts_CXX_prefix.hxx.gch: not used because `BOOST_ALL_NO_LIB' is defined [-Winvalid-pch]
  906. [ 66%] Building CXX object src/server/scripts/CMakeFiles/scripts.dir/Kalimdor/RazorfenDowns/boss_mordresh_fire_eye.cpp.o
  907. cc1plus: warning: /home/grad/TBC_New/build/src/server/scripts/cotire/scripts_CXX_prefix.hxx.gch: not used because `BOOST_ALL_NO_LIB' is defined [-Winvalid-pch]
  908. [ 66%] Building CXX object src/server/scripts/CMakeFiles/scripts.dir/Kalimdor/RazorfenDowns/boss_tuten_kash.cpp.o
  909. cc1plus: warning: /home/grad/TBC_New/build/src/server/scripts/cotire/scripts_CXX_prefix.hxx.gch: not used because `BOOST_ALL_NO_LIB' is defined [-Winvalid-pch]
  910. [ 66%] Building CXX object src/server/scripts/CMakeFiles/scripts.dir/Kalimdor/RazorfenDowns/instance_razorfen_downs.cpp.o
  911. cc1plus: warning: /home/grad/TBC_New/build/src/server/scripts/cotire/scripts_CXX_prefix.hxx.gch: not used because `BOOST_ALL_NO_LIB' is defined [-Winvalid-pch]
  912. [ 66%] Building CXX object src/server/scripts/CMakeFiles/scripts.dir/Kalimdor/RazorfenDowns/razorfen_downs.cpp.o
  913. cc1plus: warning: /home/grad/TBC_New/build/src/server/scripts/cotire/scripts_CXX_prefix.hxx.gch: not used because `BOOST_ALL_NO_LIB' is defined [-Winvalid-pch]
  914. [ 67%] Building CXX object src/server/scripts/CMakeFiles/scripts.dir/Kalimdor/RazorfenKraul/instance_razorfen_kraul.cpp.o
  915. cc1plus: warning: /home/grad/TBC_New/build/src/server/scripts/cotire/scripts_CXX_prefix.hxx.gch: not used because `BOOST_ALL_NO_LIB' is defined [-Winvalid-pch]
  916. [ 67%] Building CXX object src/server/scripts/CMakeFiles/scripts.dir/Kalimdor/RazorfenKraul/razorfen_kraul.cpp.o
  917. cc1plus: warning: /home/grad/TBC_New/build/src/server/scripts/cotire/scripts_CXX_prefix.hxx.gch: not used because `BOOST_ALL_NO_LIB' is defined [-Winvalid-pch]
  918. [ 67%] Building CXX object src/server/scripts/CMakeFiles/scripts.dir/Kalimdor/RuinsOfAhnQiraj/boss_ayamiss.cpp.o
  919. cc1plus: warning: /home/grad/TBC_New/build/src/server/scripts/cotire/scripts_CXX_prefix.hxx.gch: not used because `BOOST_ALL_NO_LIB' is defined [-Winvalid-pch]
  920. [ 67%] Building CXX object src/server/scripts/CMakeFiles/scripts.dir/Kalimdor/RuinsOfAhnQiraj/boss_buru.cpp.o
  921. cc1plus: warning: /home/grad/TBC_New/build/src/server/scripts/cotire/scripts_CXX_prefix.hxx.gch: not used because `BOOST_ALL_NO_LIB' is defined [-Winvalid-pch]
  922. [ 67%] Building CXX object src/server/scripts/CMakeFiles/scripts.dir/Kalimdor/RuinsOfAhnQiraj/boss_kurinnaxx.cpp.o
  923. cc1plus: warning: /home/grad/TBC_New/build/src/server/scripts/cotire/scripts_CXX_prefix.hxx.gch: not used because `BOOST_ALL_NO_LIB' is defined [-Winvalid-pch]
  924. [ 67%] Building CXX object src/server/scripts/CMakeFiles/scripts.dir/Kalimdor/RuinsOfAhnQiraj/boss_moam.cpp.o
  925. cc1plus: warning: /home/grad/TBC_New/build/src/server/scripts/cotire/scripts_CXX_prefix.hxx.gch: not used because `BOOST_ALL_NO_LIB' is defined [-Winvalid-pch]
  926. [ 67%] Building CXX object src/server/scripts/CMakeFiles/scripts.dir/Kalimdor/RuinsOfAhnQiraj/boss_ossirian.cpp.o
  927. cc1plus: warning: /home/grad/TBC_New/build/src/server/scripts/cotire/scripts_CXX_prefix.hxx.gch: not used because `BOOST_ALL_NO_LIB' is defined [-Winvalid-pch]
  928. [ 67%] Building CXX object src/server/scripts/CMakeFiles/scripts.dir/Kalimdor/RuinsOfAhnQiraj/boss_rajaxx.cpp.o
  929. cc1plus: warning: /home/grad/TBC_New/build/src/server/scripts/cotire/scripts_CXX_prefix.hxx.gch: not used because `BOOST_ALL_NO_LIB' is defined [-Winvalid-pch]
  930. [ 68%] Building CXX object src/server/scripts/CMakeFiles/scripts.dir/Kalimdor/RuinsOfAhnQiraj/instance_ruins_of_ahnqiraj.cpp.o
  931. cc1plus: warning: /home/grad/TBC_New/build/src/server/scripts/cotire/scripts_CXX_prefix.hxx.gch: not used because `BOOST_ALL_NO_LIB' is defined [-Winvalid-pch]
  932. [ 68%] Building CXX object src/server/scripts/CMakeFiles/scripts.dir/Kalimdor/TempleOfAhnQiraj/boss_bug_trio.cpp.o
  933. cc1plus: warning: /home/grad/TBC_New/build/src/server/scripts/cotire/scripts_CXX_prefix.hxx.gch: not used because `BOOST_ALL_NO_LIB' is defined [-Winvalid-pch]
  934. [ 68%] Building CXX object src/server/scripts/CMakeFiles/scripts.dir/Kalimdor/TempleOfAhnQiraj/boss_cthun.cpp.o
  935. cc1plus: warning: /home/grad/TBC_New/build/src/server/scripts/cotire/scripts_CXX_prefix.hxx.gch: not used because `BOOST_ALL_NO_LIB' is defined [-Winvalid-pch]
  936. [ 68%] Building CXX object src/server/scripts/CMakeFiles/scripts.dir/Kalimdor/TempleOfAhnQiraj/boss_fankriss.cpp.o
  937. cc1plus: warning: /home/grad/TBC_New/build/src/server/scripts/cotire/scripts_CXX_prefix.hxx.gch: not used because `BOOST_ALL_NO_LIB' is defined [-Winvalid-pch]
  938. [ 68%] Building CXX object src/server/scripts/CMakeFiles/scripts.dir/Kalimdor/TempleOfAhnQiraj/boss_huhuran.cpp.o
  939. cc1plus: warning: /home/grad/TBC_New/build/src/server/scripts/cotire/scripts_CXX_prefix.hxx.gch: not used because `BOOST_ALL_NO_LIB' is defined [-Winvalid-pch]
  940. [ 68%] Building CXX object src/server/scripts/CMakeFiles/scripts.dir/Kalimdor/TempleOfAhnQiraj/boss_ouro.cpp.o
  941. cc1plus: warning: /home/grad/TBC_New/build/src/server/scripts/cotire/scripts_CXX_prefix.hxx.gch: not used because `BOOST_ALL_NO_LIB' is defined [-Winvalid-pch]
  942. [ 68%] Building CXX object src/server/scripts/CMakeFiles/scripts.dir/Kalimdor/TempleOfAhnQiraj/boss_sartura.cpp.o
  943. cc1plus: warning: /home/grad/TBC_New/build/src/server/scripts/cotire/scripts_CXX_prefix.hxx.gch: not used because `BOOST_ALL_NO_LIB' is defined [-Winvalid-pch]
  944. [ 68%] Building CXX object src/server/scripts/CMakeFiles/scripts.dir/Kalimdor/TempleOfAhnQiraj/boss_skeram.cpp.o
  945. cc1plus: warning: /home/grad/TBC_New/build/src/server/scripts/cotire/scripts_CXX_prefix.hxx.gch: not used because `BOOST_ALL_NO_LIB' is defined [-Winvalid-pch]
  946. [ 68%] Building CXX object src/server/scripts/CMakeFiles/scripts.dir/Kalimdor/TempleOfAhnQiraj/boss_twinemperors.cpp.o
  947. cc1plus: warning: /home/grad/TBC_New/build/src/server/scripts/cotire/scripts_CXX_prefix.hxx.gch: not used because `BOOST_ALL_NO_LIB' is defined [-Winvalid-pch]
  948. [ 69%] Building CXX object src/server/scripts/CMakeFiles/scripts.dir/Kalimdor/TempleOfAhnQiraj/boss_viscidus.cpp.o
  949. cc1plus: warning: /home/grad/TBC_New/build/src/server/scripts/cotire/scripts_CXX_prefix.hxx.gch: not used because `BOOST_ALL_NO_LIB' is defined [-Winvalid-pch]
  950. [ 69%] Building CXX object src/server/scripts/CMakeFiles/scripts.dir/Kalimdor/TempleOfAhnQiraj/instance_temple_of_ahnqiraj.cpp.o
  951. cc1plus: warning: /home/grad/TBC_New/build/src/server/scripts/cotire/scripts_CXX_prefix.hxx.gch: not used because `BOOST_ALL_NO_LIB' is defined [-Winvalid-pch]
  952. [ 69%] Building CXX object src/server/scripts/CMakeFiles/scripts.dir/Kalimdor/TempleOfAhnQiraj/mob_anubisath_sentinel.cpp.o
  953. cc1plus: warning: /home/grad/TBC_New/build/src/server/scripts/cotire/scripts_CXX_prefix.hxx.gch: not used because `BOOST_ALL_NO_LIB' is defined [-Winvalid-pch]
  954. [ 69%] Building CXX object src/server/scripts/CMakeFiles/scripts.dir/Kalimdor/WailingCaverns/instance_wailing_caverns.cpp.o
  955. cc1plus: warning: /home/grad/TBC_New/build/src/server/scripts/cotire/scripts_CXX_prefix.hxx.gch: not used because `BOOST_ALL_NO_LIB' is defined [-Winvalid-pch]
  956. [ 69%] Building CXX object src/server/scripts/CMakeFiles/scripts.dir/Kalimdor/WailingCaverns/wailing_caverns.cpp.o
  957. cc1plus: warning: /home/grad/TBC_New/build/src/server/scripts/cotire/scripts_CXX_prefix.hxx.gch: not used because `BOOST_ALL_NO_LIB' is defined [-Winvalid-pch]
  958. [ 69%] Building CXX object src/server/scripts/CMakeFiles/scripts.dir/Kalimdor/ZulFarrak/boss_zum_rah.cpp.o
  959. cc1plus: warning: /home/grad/TBC_New/build/src/server/scripts/cotire/scripts_CXX_prefix.hxx.gch: not used because `BOOST_ALL_NO_LIB' is defined [-Winvalid-pch]
  960. [ 69%] Building CXX object src/server/scripts/CMakeFiles/scripts.dir/Kalimdor/ZulFarrak/instance_zulfarrak.cpp.o
  961. cc1plus: warning: /home/grad/TBC_New/build/src/server/scripts/cotire/scripts_CXX_prefix.hxx.gch: not used because `BOOST_ALL_NO_LIB' is defined [-Winvalid-pch]
  962. [ 69%] Building CXX object src/server/scripts/CMakeFiles/scripts.dir/Kalimdor/ZulFarrak/zulfarrak.cpp.o
  963. cc1plus: warning: /home/grad/TBC_New/build/src/server/scripts/cotire/scripts_CXX_prefix.hxx.gch: not used because `BOOST_ALL_NO_LIB' is defined [-Winvalid-pch]
  964. [ 70%] Building CXX object src/server/scripts/CMakeFiles/scripts.dir/OutdoorPvP/OutdoorPvPEP.cpp.o
  965. cc1plus: warning: /home/grad/TBC_New/build/src/server/scripts/cotire/scripts_CXX_prefix.hxx.gch: not used because `BOOST_ALL_NO_LIB' is defined [-Winvalid-pch]
  966. [ 70%] Building CXX object src/server/scripts/CMakeFiles/scripts.dir/OutdoorPvP/OutdoorPvPHP.cpp.o
  967. cc1plus: warning: /home/grad/TBC_New/build/src/server/scripts/cotire/scripts_CXX_prefix.hxx.gch: not used because `BOOST_ALL_NO_LIB' is defined [-Winvalid-pch]
  968. [ 70%] Building CXX object src/server/scripts/CMakeFiles/scripts.dir/OutdoorPvP/OutdoorPvPNA.cpp.o
  969. cc1plus: warning: /home/grad/TBC_New/build/src/server/scripts/cotire/scripts_CXX_prefix.hxx.gch: not used because `BOOST_ALL_NO_LIB' is defined [-Winvalid-pch]
  970. [ 70%] Building CXX object src/server/scripts/CMakeFiles/scripts.dir/OutdoorPvP/OutdoorPvPSI.cpp.o
  971. cc1plus: warning: /home/grad/TBC_New/build/src/server/scripts/cotire/scripts_CXX_prefix.hxx.gch: not used because `BOOST_ALL_NO_LIB' is defined [-Winvalid-pch]
  972. [ 70%] Building CXX object src/server/scripts/CMakeFiles/scripts.dir/OutdoorPvP/OutdoorPvPScriptLoader.cpp.o
  973. cc1plus: warning: /home/grad/TBC_New/build/src/server/scripts/cotire/scripts_CXX_prefix.hxx.gch: not used because `BOOST_ALL_NO_LIB' is defined [-Winvalid-pch]
  974. [ 70%] Building CXX object src/server/scripts/CMakeFiles/scripts.dir/OutdoorPvP/OutdoorPvPTF.cpp.o
  975. cc1plus: warning: /home/grad/TBC_New/build/src/server/scripts/cotire/scripts_CXX_prefix.hxx.gch: not used because `BOOST_ALL_NO_LIB' is defined [-Winvalid-pch]
  976. [ 70%] Building CXX object src/server/scripts/CMakeFiles/scripts.dir/OutdoorPvP/OutdoorPvPZM.cpp.o
  977. cc1plus: warning: /home/grad/TBC_New/build/src/server/scripts/cotire/scripts_CXX_prefix.hxx.gch: not used because `BOOST_ALL_NO_LIB' is defined [-Winvalid-pch]
  978. [ 70%] Building CXX object src/server/scripts/CMakeFiles/scripts.dir/Outland/blades_edge_mountains.cpp.o
  979. cc1plus: warning: /home/grad/TBC_New/build/src/server/scripts/cotire/scripts_CXX_prefix.hxx.gch: not used because `BOOST_ALL_NO_LIB' is defined [-Winvalid-pch]
  980. [ 70%] Building CXX object src/server/scripts/CMakeFiles/scripts.dir/Outland/boss_doomlord_kazzak.cpp.o
  981. cc1plus: warning: /home/grad/TBC_New/build/src/server/scripts/cotire/scripts_CXX_prefix.hxx.gch: not used because `BOOST_ALL_NO_LIB' is defined [-Winvalid-pch]
  982. [ 71%] Building CXX object src/server/scripts/CMakeFiles/scripts.dir/Outland/boss_doomwalker.cpp.o
  983. cc1plus: warning: /home/grad/TBC_New/build/src/server/scripts/cotire/scripts_CXX_prefix.hxx.gch: not used because `BOOST_ALL_NO_LIB' is defined [-Winvalid-pch]
  984. [ 71%] Building CXX object src/server/scripts/CMakeFiles/scripts.dir/Outland/hellfire_peninsula.cpp.o
  985. cc1plus: warning: /home/grad/TBC_New/build/src/server/scripts/cotire/scripts_CXX_prefix.hxx.gch: not used because `BOOST_ALL_NO_LIB' is defined [-Winvalid-pch]
  986. /home/grad/TBC_New/src/server/scripts/Outland/blades_edge_mountains.cpp: In member function ‘void npc_simon_bunny::npc_simon_bunnyAI::StartGame()’:
  987. /home/grad/TBC_New/src/server/scripts/Outland/blades_edge_mountains.cpp:791:21: error: ‘class Creature’ has no member named ‘VisitNearbyObject’
  988.   791 |                 me->VisitNearbyObject(searchDistance, searcher);
  989.       |                     ^~~~~~~~~~~~~~~~~
  990. [ 71%] Building CXX object src/server/scripts/CMakeFiles/scripts.dir/Outland/nagrand.cpp.o
  991. cc1plus: warning: /home/grad/TBC_New/build/src/server/scripts/cotire/scripts_CXX_prefix.hxx.gch: not used because `BOOST_ALL_NO_LIB' is defined [-Winvalid-pch]
  992. [ 71%] Building CXX object src/server/scripts/CMakeFiles/scripts.dir/Outland/netherstorm.cpp.o
  993. cc1plus: warning: /home/grad/TBC_New/build/src/server/scripts/cotire/scripts_CXX_prefix.hxx.gch: not used because `BOOST_ALL_NO_LIB' is defined [-Winvalid-pch]
  994. make[2]: *** [src/server/scripts/CMakeFiles/scripts.dir/build.make:4521: src/server/scripts/CMakeFiles/scripts.dir/Outland/blades_edge_mountains.cpp.o] Ошибка 1
  995. make[2]: *** Ожидание завершения заданий…
  996. make[1]: *** [CMakeFiles/Makefile2:1167: src/server/scripts/CMakeFiles/scripts.dir/all] Ошибка 2
  997. make: *** [Makefile:149: all] Ошибка 2
  998.  

A PHP Error was encountered

Severity: Core Warning

Message: PHP Startup: Unable to load dynamic library 'mcrypt.so' (tried: /usr/lib/php/20170718/mcrypt.so (/usr/lib/php/20170718/mcrypt.so: cannot open shared object file: No such file or directory), /usr/lib/php/20170718/mcrypt.so.so (/usr/lib/php/20170718/mcrypt.so.so: cannot open shared object file: No such file or directory))

Filename: Unknown

Line Number: 0

Backtrace: