From grad, 11 Months ago, written in Plain Text.
Embed
  1. [ 11%] Building CXX object src/common/CMakeFiles/common.dir/Collision/Maps/MapTree.cpp.o
  2. [ 11%] Building CXX object src/common/CMakeFiles/common.dir/Collision/Maps/TileAssembler.cpp.o
  3. [ 11%] Building CXX object src/common/CMakeFiles/common.dir/Collision/Models/GameObjectModel.cpp.o
  4. In file included from /home/grad/TBC_New/src/common/Logging/Log.h:23,
  5.                  from /home/grad/TBC_New/src/common/Collision/DynamicTree.cpp:24:
  6. /home/grad/TBC_New/src/common/Asio/AsioHacksFwd.h:50:9: error: expected unqualified-id before ‘namespace’
  7.    50 |         namespace ip
  8.       |         ^~~~~~~~~
  9. /home/grad/TBC_New/src/common/Asio/AsioHacksFwd.h:63:15: error: redeclared with 2 template parameters
  10.    63 |         class basic_deadline_timer
  11.       |               ^~~~~~~~~~~~~~~~~~~~
  12. In file included from /home/grad/TBC_New/src/common/Asio/AsioHacksFwd.h:31,
  13.                  from /home/grad/TBC_New/src/common/Logging/Log.h:23,
  14.                  from /home/grad/TBC_New/src/common/Collision/DynamicTree.cpp:24:
  15. /usr/include/boost/asio/basic_deadline_timer.hpp:130:7: note: previous declaration ‘template<class Time, class TimeTraits, class Executor> class boost::asio::basic_deadline_timer’ used 3 template parameters
  16.   130 | class basic_deadline_timer
  17.       |       ^~~~~~~~~~~~~~~~~~~~
  18. In file included from /home/grad/TBC_New/src/common/Logging/Log.h:23,
  19.                  from /home/grad/TBC_New/src/common/Collision/DynamicTree.cpp:24:
  20. /home/grad/TBC_New/src/common/Asio/AsioHacksFwd.h:77:36: error: ‘tcp’ was not declared in this scope
  21.    77 |             typedef basic_resolver<tcp> tcp_resolver;
  22.       |                                    ^~~
  23. /home/grad/TBC_New/src/common/Asio/AsioHacksFwd.h:77:39: error: template argument 1 is invalid
  24.    77 |             typedef basic_resolver<tcp> tcp_resolver;
  25.       |                                       ^
  26. [ 11%] Building CXX object src/common/CMakeFiles/common.dir/Collision/Models/ModelInstance.cpp.o
  27. In file included from /home/grad/TBC_New/src/common/Logging/Log.h:23,
  28.                  from /home/grad/TBC_New/src/common/Collision/Maps/MapTree.cpp:23:
  29. /home/grad/TBC_New/src/common/Asio/AsioHacksFwd.h:50:9: error: expected unqualified-id before ‘namespace’
  30.    50 |         namespace ip
  31.       |         ^~~~~~~~~
  32. /home/grad/TBC_New/src/common/Asio/AsioHacksFwd.h:63:15: error: redeclared with 2 template parameters
  33.    63 |         class basic_deadline_timer
  34.       |               ^~~~~~~~~~~~~~~~~~~~
  35. In file included from /home/grad/TBC_New/src/common/Asio/AsioHacksFwd.h:31,
  36.                  from /home/grad/TBC_New/src/common/Logging/Log.h:23,
  37.                  from /home/grad/TBC_New/src/common/Collision/Maps/MapTree.cpp:23:
  38. /usr/include/boost/asio/basic_deadline_timer.hpp:130:7: note: previous declaration ‘template<class Time, class TimeTraits, class Executor> class boost::asio::basic_deadline_timer’ used 3 template parameters
  39.   130 | class basic_deadline_timer
  40.       |       ^~~~~~~~~~~~~~~~~~~~
  41. In file included from /home/grad/TBC_New/src/common/Logging/Log.h:23,
  42.                  from /home/grad/TBC_New/src/common/Collision/Maps/MapTree.cpp:23:
  43. /home/grad/TBC_New/src/common/Asio/AsioHacksFwd.h:77:36: error: ‘tcp’ was not declared in this scope
  44.    77 |             typedef basic_resolver<tcp> tcp_resolver;
  45.       |                                    ^~~
  46. /home/grad/TBC_New/src/common/Asio/AsioHacksFwd.h:77:39: error: template argument 1 is invalid
  47.    77 |             typedef basic_resolver<tcp> tcp_resolver;
  48.       |                                       ^
  49. In file included from /home/grad/TBC_New/src/common/Logging/Log.h:23,
  50.                  from /home/grad/TBC_New/src/common/Collision/Management/VMapManager2.cpp:28:
  51. /home/grad/TBC_New/src/common/Asio/AsioHacksFwd.h:50:9: error: expected unqualified-id before ‘namespace’
  52.    50 |         namespace ip
  53.       |         ^~~~~~~~~
  54. /home/grad/TBC_New/src/common/Asio/AsioHacksFwd.h:63:15: error: redeclared with 2 template parameters
  55.    63 |         class basic_deadline_timer
  56.       |               ^~~~~~~~~~~~~~~~~~~~
  57. In file included from /home/grad/TBC_New/src/common/Asio/AsioHacksFwd.h:31,
  58.                  from /home/grad/TBC_New/src/common/Logging/Log.h:23,
  59.                  from /home/grad/TBC_New/src/common/Collision/Management/VMapManager2.cpp:28:
  60. /usr/include/boost/asio/basic_deadline_timer.hpp:130:7: note: previous declaration ‘template<class Time, class TimeTraits, class Executor> class boost::asio::basic_deadline_timer’ used 3 template parameters
  61.   130 | class basic_deadline_timer
  62.       |       ^~~~~~~~~~~~~~~~~~~~
  63. In file included from /home/grad/TBC_New/src/common/Logging/Log.h:23,
  64.                  from /home/grad/TBC_New/src/common/Collision/Management/VMapManager2.cpp:28:
  65. /home/grad/TBC_New/src/common/Asio/AsioHacksFwd.h:77:36: error: ‘tcp’ was not declared in this scope
  66.    77 |             typedef basic_resolver<tcp> tcp_resolver;
  67.       |                                    ^~~
  68. /home/grad/TBC_New/src/common/Asio/AsioHacksFwd.h:77:39: error: template argument 1 is invalid
  69.    77 |             typedef basic_resolver<tcp> tcp_resolver;
  70.       |                                       ^
  71. In file included from /home/grad/TBC_New/src/common/Logging/Log.h:23,
  72.                  from /home/grad/TBC_New/src/common/Collision/Management/MMapManager.cpp:20:
  73. /home/grad/TBC_New/src/common/Asio/AsioHacksFwd.h:50:9: error: expected unqualified-id before ‘namespace’
  74.    50 |         namespace ip
  75.       |         ^~~~~~~~~
  76. /home/grad/TBC_New/src/common/Asio/AsioHacksFwd.h:63:15: error: redeclared with 2 template parameters
  77.    63 |         class basic_deadline_timer
  78.       |               ^~~~~~~~~~~~~~~~~~~~
  79. In file included from /home/grad/TBC_New/src/common/Asio/AsioHacksFwd.h:31,
  80.                  from /home/grad/TBC_New/src/common/Logging/Log.h:23,
  81.                  from /home/grad/TBC_New/src/common/Collision/Management/MMapManager.cpp:20:
  82. /usr/include/boost/asio/basic_deadline_timer.hpp:130:7: note: previous declaration ‘template<class Time, class TimeTraits, class Executor> class boost::asio::basic_deadline_timer’ used 3 template parameters
  83.   130 | class basic_deadline_timer
  84.       |       ^~~~~~~~~~~~~~~~~~~~
  85. In file included from /home/grad/TBC_New/src/common/Logging/Log.h:23,
  86.                  from /home/grad/TBC_New/src/common/Collision/Management/MMapManager.cpp:20:
  87. /home/grad/TBC_New/src/common/Asio/AsioHacksFwd.h:77:36: error: ‘tcp’ was not declared in this scope
  88.    77 |             typedef basic_resolver<tcp> tcp_resolver;
  89.       |                                    ^~~
  90. /home/grad/TBC_New/src/common/Asio/AsioHacksFwd.h:77:39: error: template argument 1 is invalid
  91.    77 |             typedef basic_resolver<tcp> tcp_resolver;
  92.       |                                       ^
  93. [ 11%] Building CXX object src/common/CMakeFiles/common.dir/Collision/Models/WorldModel.cpp.o
  94. In file included from /home/grad/TBC_New/src/common/Logging/Log.h:23,
  95.                  from /home/grad/TBC_New/src/common/Collision/Models/GameObjectModel.cpp:26:
  96. /home/grad/TBC_New/src/common/Asio/AsioHacksFwd.h:50:9: error: expected unqualified-id before ‘namespace’
  97.    50 |         namespace ip
  98.       |         ^~~~~~~~~
  99. /home/grad/TBC_New/src/common/Asio/AsioHacksFwd.h:63:15: error: redeclared with 2 template parameters
  100.    63 |         class basic_deadline_timer
  101.       |               ^~~~~~~~~~~~~~~~~~~~
  102. In file included from /home/grad/TBC_New/src/common/Asio/AsioHacksFwd.h:31,
  103.                  from /home/grad/TBC_New/src/common/Logging/Log.h:23,
  104.                  from /home/grad/TBC_New/src/common/Collision/Models/GameObjectModel.cpp:26:
  105. /usr/include/boost/asio/basic_deadline_timer.hpp:130:7: note: previous declaration ‘template<class Time, class TimeTraits, class Executor> class boost::asio::basic_deadline_timer’ used 3 template parameters
  106.   130 | class basic_deadline_timer
  107.       |       ^~~~~~~~~~~~~~~~~~~~
  108. In file included from /home/grad/TBC_New/src/common/Logging/Log.h:23,
  109.                  from /home/grad/TBC_New/src/common/Collision/Models/GameObjectModel.cpp:26:
  110. /home/grad/TBC_New/src/common/Asio/AsioHacksFwd.h:77:36: error: ‘tcp’ was not declared in this scope
  111.    77 |             typedef basic_resolver<tcp> tcp_resolver;
  112.       |                                    ^~~
  113. /home/grad/TBC_New/src/common/Asio/AsioHacksFwd.h:77:39: error: template argument 1 is invalid
  114.    77 |             typedef basic_resolver<tcp> tcp_resolver;
  115.       |                                       ^
  116. make[2]: *** [src/common/CMakeFiles/common.dir/build.make:153: src/common/CMakeFiles/common.dir/Collision/DynamicTree.cpp.o] Ошибка 1
  117. make[2]: *** Ожидание завершения заданий…
  118. make[2]: *** [src/common/CMakeFiles/common.dir/build.make:223: src/common/CMakeFiles/common.dir/Collision/Maps/MapTree.cpp.o] Ошибка 1
  119. make[2]: *** [src/common/CMakeFiles/common.dir/build.make:209: src/common/CMakeFiles/common.dir/Collision/Management/VMapManager2.cpp.o] Ошибка 1
  120. make[2]: *** [src/common/CMakeFiles/common.dir/build.make:251: src/common/CMakeFiles/common.dir/Collision/Models/GameObjectModel.cpp.o] Ошибка 1
  121. make[2]: *** [src/common/CMakeFiles/common.dir/build.make:181: src/common/CMakeFiles/common.dir/Collision/Management/MMapManager.cpp.o] Ошибка 1
  122. make[1]: *** [CMakeFiles/Makefile2:934: src/common/CMakeFiles/common.dir/all] Ошибка 2
  123. make: *** [Makefile:149: all] Ошибка 2
  124.  

A PHP Error was encountered

Severity: Core Warning

Message: PHP Startup: Unable to load dynamic library 'mcrypt.so' (tried: /usr/lib/php/20170718/mcrypt.so (/usr/lib/php/20170718/mcrypt.so: cannot open shared object file: No such file or directory), /usr/lib/php/20170718/mcrypt.so.so (/usr/lib/php/20170718/mcrypt.so.so: cannot open shared object file: No such file or directory))

Filename: Unknown

Line Number: 0

Backtrace: