From grad, 11 Months ago, written in Plain Text.
Embed
  1. [ 11%] Building CXX object src/common/CMakeFiles/common.dir/Collision/Models/GameObjectModel.cpp.o
  2. [ 11%] Building CXX object src/common/CMakeFiles/common.dir/Collision/Models/ModelInstance.cpp.o
  3. In file included from /home/grad/TBC_New/src/common/Logging/Log.h:23,
  4.                  from /home/grad/TBC_New/src/common/Collision/DynamicTree.cpp:24:
  5. /home/grad/TBC_New/src/common/Asio/AsioHacksFwd.h:50:9: error: expected unqualified-id before ‘namespace’
  6.    50 |         namespace ip
  7.       |         ^~~~~~~~~
  8. /home/grad/TBC_New/src/common/Asio/AsioHacksFwd.h:65:31: error: ‘ctime’ does not name a type
  9.    65 |   typename ExecutionContext = ctime,
  10.       |                               ^~~~~
  11. /home/grad/TBC_New/src/common/Asio/AsioHacksFwd.h:67:15: error: redefinition of default argument for ‘class ExecutionContext’
  12.    67 |         class basic_deadline_timer
  13.       |               ^~~~~~~~~~~~~~~~~~~~
  14. In file included from /home/grad/TBC_New/src/common/Asio/AsioHacksFwd.h:31,
  15.                  from /home/grad/TBC_New/src/common/Logging/Log.h:23,
  16.                  from /home/grad/TBC_New/src/common/Collision/DynamicTree.cpp:24:
  17. /usr/include/boost/asio/basic_deadline_timer.hpp:128:5: note: original definition appeared here
  18.   128 |     typename TimeTraits = boost::asio::time_traits<Time>,
  19.       |     ^~~~~~~~
  20. In file included from /home/grad/TBC_New/src/common/Logging/Log.h:23,
  21.                  from /home/grad/TBC_New/src/common/Collision/Maps/MapTree.cpp:23:
  22. /home/grad/TBC_New/src/common/Asio/AsioHacksFwd.h:50:9: error: expected unqualified-id before ‘namespace’
  23.    50 |         namespace ip
  24.       |         ^~~~~~~~~
  25. /home/grad/TBC_New/src/common/Asio/AsioHacksFwd.h:65:31: error: ‘ctime’ does not name a type
  26.    65 |   typename ExecutionContext = ctime,
  27.       |                               ^~~~~
  28. /home/grad/TBC_New/src/common/Asio/AsioHacksFwd.h:67:15: error: redefinition of default argument for ‘class ExecutionContext’
  29.    67 |         class basic_deadline_timer
  30.       |               ^~~~~~~~~~~~~~~~~~~~
  31. In file included from /home/grad/TBC_New/src/common/Asio/AsioHacksFwd.h:31,
  32.                  from /home/grad/TBC_New/src/common/Logging/Log.h:23,
  33.                  from /home/grad/TBC_New/src/common/Collision/Maps/MapTree.cpp:23:
  34. /usr/include/boost/asio/basic_deadline_timer.hpp:128:5: note: original definition appeared here
  35.   128 |     typename TimeTraits = boost::asio::time_traits<Time>,
  36.       |     ^~~~~~~~
  37. In file included from /home/grad/TBC_New/src/common/Logging/Log.h:23,
  38.                  from /home/grad/TBC_New/src/common/Collision/Management/VMapManager2.cpp:28:
  39. /home/grad/TBC_New/src/common/Asio/AsioHacksFwd.h:50:9: error: expected unqualified-id before ‘namespace’
  40.    50 |         namespace ip
  41.       |         ^~~~~~~~~
  42. /home/grad/TBC_New/src/common/Asio/AsioHacksFwd.h:65:31: error: ‘ctime’ does not name a type
  43.    65 |   typename ExecutionContext = ctime,
  44.       |                               ^~~~~
  45. /home/grad/TBC_New/src/common/Asio/AsioHacksFwd.h:67:15: error: redefinition of default argument for ‘class ExecutionContext’
  46.    67 |         class basic_deadline_timer
  47.       |               ^~~~~~~~~~~~~~~~~~~~
  48. In file included from /home/grad/TBC_New/src/common/Asio/AsioHacksFwd.h:31,
  49.                  from /home/grad/TBC_New/src/common/Logging/Log.h:23,
  50.                  from /home/grad/TBC_New/src/common/Collision/Management/VMapManager2.cpp:28:
  51. /usr/include/boost/asio/basic_deadline_timer.hpp:128:5: note: original definition appeared here
  52.   128 |     typename TimeTraits = boost::asio::time_traits<Time>,
  53.       |     ^~~~~~~~
  54. [ 11%] Building CXX object src/common/CMakeFiles/common.dir/Collision/Models/WorldModel.cpp.o
  55. In file included from /home/grad/TBC_New/src/common/Logging/Log.h:23,
  56.                  from /home/grad/TBC_New/src/common/Collision/Management/MMapManager.cpp:20:
  57. /home/grad/TBC_New/src/common/Asio/AsioHacksFwd.h:50:9: error: expected unqualified-id before ‘namespace’
  58.    50 |         namespace ip
  59.       |         ^~~~~~~~~
  60. /home/grad/TBC_New/src/common/Asio/AsioHacksFwd.h:65:31: error: ‘ctime’ does not name a type
  61.    65 |   typename ExecutionContext = ctime,
  62.       |                               ^~~~~
  63. /home/grad/TBC_New/src/common/Asio/AsioHacksFwd.h:67:15: error: redefinition of default argument for ‘class ExecutionContext’
  64.    67 |         class basic_deadline_timer
  65.       |               ^~~~~~~~~~~~~~~~~~~~
  66. In file included from /home/grad/TBC_New/src/common/Asio/AsioHacksFwd.h:31,
  67.                  from /home/grad/TBC_New/src/common/Logging/Log.h:23,
  68.                  from /home/grad/TBC_New/src/common/Collision/Management/MMapManager.cpp:20:
  69. /usr/include/boost/asio/basic_deadline_timer.hpp:128:5: note: original definition appeared here
  70.   128 |     typename TimeTraits = boost::asio::time_traits<Time>,
  71.       |     ^~~~~~~~
  72. [ 11%] Building CXX object src/common/CMakeFiles/common.dir/Collision/PrecompiledHeaders/collisionPCH.cpp.o
  73. In file included from /home/grad/TBC_New/src/common/Logging/Log.h:23,
  74.                  from /home/grad/TBC_New/src/common/Collision/Models/GameObjectModel.cpp:26:
  75. /home/grad/TBC_New/src/common/Asio/AsioHacksFwd.h:50:9: error: expected unqualified-id before ‘namespace’
  76.    50 |         namespace ip
  77.       |         ^~~~~~~~~
  78. /home/grad/TBC_New/src/common/Asio/AsioHacksFwd.h:65:31: error: ‘ctime’ does not name a type
  79.    65 |   typename ExecutionContext = ctime,
  80.       |                               ^~~~~
  81. /home/grad/TBC_New/src/common/Asio/AsioHacksFwd.h:67:15: error: redefinition of default argument for ‘class ExecutionContext’
  82.    67 |         class basic_deadline_timer
  83.       |               ^~~~~~~~~~~~~~~~~~~~
  84. In file included from /home/grad/TBC_New/src/common/Asio/AsioHacksFwd.h:31,
  85.                  from /home/grad/TBC_New/src/common/Logging/Log.h:23,
  86.                  from /home/grad/TBC_New/src/common/Collision/Models/GameObjectModel.cpp:26:
  87. /usr/include/boost/asio/basic_deadline_timer.hpp:128:5: note: original definition appeared here
  88.   128 |     typename TimeTraits = boost::asio::time_traits<Time>,
  89.       |     ^~~~~~~~
  90. [ 12%] Building CXX object src/common/CMakeFiles/common.dir/Configuration/Config.cpp.o
  91. [ 12%] Building CXX object src/common/CMakeFiles/common.dir/Configuration/BuiltInConfig.cpp.o
  92. make[2]: *** [src/common/CMakeFiles/common.dir/build.make:153: src/common/CMakeFiles/common.dir/Collision/DynamicTree.cpp.o] Ошибка 1
  93. make[2]: *** Ожидание завершения заданий…
  94. make[2]: *** [src/common/CMakeFiles/common.dir/build.make:223: src/common/CMakeFiles/common.dir/Collision/Maps/MapTree.cpp.o] Ошибка 1
  95. make[2]: *** [src/common/CMakeFiles/common.dir/build.make:209: src/common/CMakeFiles/common.dir/Collision/Management/VMapManager2.cpp.o] Ошибка 1
  96. make[2]: *** [src/common/CMakeFiles/common.dir/build.make:251: src/common/CMakeFiles/common.dir/Collision/Models/GameObjectModel.cpp.o] Ошибка 1
  97. In file included from /home/grad/TBC_New/src/common/Logging/Log.h:23,
  98.                  from /home/grad/TBC_New/src/common/Configuration/Config.cpp:25:
  99. /home/grad/TBC_New/src/common/Asio/AsioHacksFwd.h:50:9: error: expected unqualified-id before ‘namespace’
  100.    50 |         namespace ip
  101.       |         ^~~~~~~~~
  102. /home/grad/TBC_New/src/common/Asio/AsioHacksFwd.h:65:31: error: ‘ctime’ does not name a type
  103.    65 |   typename ExecutionContext = ctime,
  104.       |                               ^~~~~
  105. /home/grad/TBC_New/src/common/Asio/AsioHacksFwd.h:67:15: error: redefinition of default argument for ‘class ExecutionContext’
  106.    67 |         class basic_deadline_timer
  107.       |               ^~~~~~~~~~~~~~~~~~~~
  108. In file included from /home/grad/TBC_New/src/common/Asio/AsioHacksFwd.h:31,
  109.                  from /home/grad/TBC_New/src/common/Logging/Log.h:23,
  110.                  from /home/grad/TBC_New/src/common/Configuration/Config.cpp:25:
  111. /usr/include/boost/asio/basic_deadline_timer.hpp:128:5: note: original definition appeared here
  112.   128 |     typename TimeTraits = boost::asio::time_traits<Time>,
  113.       |     ^~~~~~~~
  114. make[2]: *** [src/common/CMakeFiles/common.dir/build.make:181: src/common/CMakeFiles/common.dir/Collision/Management/MMapManager.cpp.o] Ошибка 1
  115. make[2]: *** [src/common/CMakeFiles/common.dir/build.make:321: src/common/CMakeFiles/common.dir/Configuration/Config.cpp.o] Ошибка 1
  116. make[1]: *** [CMakeFiles/Makefile2:934: src/common/CMakeFiles/common.dir/all] Ошибка 2
  117. make: *** [Makefile:149: all] Ошибка 2
  118.  

A PHP Error was encountered

Severity: Core Warning

Message: PHP Startup: Unable to load dynamic library 'mcrypt.so' (tried: /usr/lib/php/20170718/mcrypt.so (/usr/lib/php/20170718/mcrypt.so: cannot open shared object file: No such file or directory), /usr/lib/php/20170718/mcrypt.so.so (/usr/lib/php/20170718/mcrypt.so.so: cannot open shared object file: No such file or directory))

Filename: Unknown

Line Number: 0

Backtrace: