From grad, 11 Months ago, written in Plain Text.
Embed
  1. [ 11%] Building CXX object src/common/CMakeFiles/common.dir/Collision/Maps/TileAssembler.cpp.o
  2. [ 11%] Building CXX object src/common/CMakeFiles/common.dir/Collision/Models/GameObjectModel.cpp.o
  3. [ 11%] Building CXX object src/common/CMakeFiles/common.dir/Collision/Models/ModelInstance.cpp.o
  4. In file included from /home/grad/TBC_New/src/common/Logging/Log.h:23,
  5.                  from /home/grad/TBC_New/src/common/Collision/DynamicTree.cpp:24:
  6. /home/grad/TBC_New/src/common/Asio/AsioHacksFwd.h:55:15: error: redefinition of default argument for ‘class TimeTraits’
  7.    55 |         class basic_deadline_timer;
  8.       |               ^~~~~~~~~~~~~~~~~~~~
  9. In file included from /home/grad/TBC_New/src/common/Asio/AsioHacksFwd.h:23,
  10.                  from /home/grad/TBC_New/src/common/Logging/Log.h:23,
  11.                  from /home/grad/TBC_New/src/common/Collision/DynamicTree.cpp:24:
  12. /usr/include/boost/asio/basic_deadline_timer.hpp:128:5: note: original definition appeared here
  13.   128 |     typename TimeTraits = boost::asio::time_traits<Time>,
  14.       |     ^~~~~~~~
  15. In file included from /home/grad/TBC_New/src/common/Logging/Log.h:23,
  16.                  from /home/grad/TBC_New/src/common/Collision/Maps/MapTree.cpp:23:
  17. /home/grad/TBC_New/src/common/Asio/AsioHacksFwd.h:55:15: error: redefinition of default argument for ‘class TimeTraits’
  18.    55 |         class basic_deadline_timer;
  19.       |               ^~~~~~~~~~~~~~~~~~~~
  20. In file included from /home/grad/TBC_New/src/common/Asio/AsioHacksFwd.h:23,
  21.                  from /home/grad/TBC_New/src/common/Logging/Log.h:23,
  22.                  from /home/grad/TBC_New/src/common/Collision/Maps/MapTree.cpp:23:
  23. /usr/include/boost/asio/basic_deadline_timer.hpp:128:5: note: original definition appeared here
  24.   128 |     typename TimeTraits = boost::asio::time_traits<Time>,
  25.       |     ^~~~~~~~
  26. [ 11%] Building CXX object src/common/CMakeFiles/common.dir/Collision/Models/WorldModel.cpp.o
  27. In file included from /home/grad/TBC_New/src/common/Logging/Log.h:23,
  28.                  from /home/grad/TBC_New/src/common/Collision/Management/MMapManager.cpp:20:
  29. /home/grad/TBC_New/src/common/Asio/AsioHacksFwd.h:55:15: error: redefinition of default argument for ‘class TimeTraits’
  30.    55 |         class basic_deadline_timer;
  31.       |               ^~~~~~~~~~~~~~~~~~~~
  32. In file included from /home/grad/TBC_New/src/common/Asio/AsioHacksFwd.h:23,
  33.                  from /home/grad/TBC_New/src/common/Logging/Log.h:23,
  34.                  from /home/grad/TBC_New/src/common/Collision/Management/MMapManager.cpp:20:
  35. /usr/include/boost/asio/basic_deadline_timer.hpp:128:5: note: original definition appeared here
  36.   128 |     typename TimeTraits = boost::asio::time_traits<Time>,
  37.       |     ^~~~~~~~
  38. In file included from /home/grad/TBC_New/src/common/Logging/Log.h:23,
  39.                  from /home/grad/TBC_New/src/common/Collision/Management/VMapManager2.cpp:28:
  40. /home/grad/TBC_New/src/common/Asio/AsioHacksFwd.h:55:15: error: redefinition of default argument for ‘class TimeTraits’
  41.    55 |         class basic_deadline_timer;
  42.       |               ^~~~~~~~~~~~~~~~~~~~
  43. In file included from /home/grad/TBC_New/src/common/Asio/AsioHacksFwd.h:23,
  44.                  from /home/grad/TBC_New/src/common/Logging/Log.h:23,
  45.                  from /home/grad/TBC_New/src/common/Collision/Management/VMapManager2.cpp:28:
  46. /usr/include/boost/asio/basic_deadline_timer.hpp:128:5: note: original definition appeared here
  47.   128 |     typename TimeTraits = boost::asio::time_traits<Time>,
  48.       |     ^~~~~~~~
  49. In file included from /home/grad/TBC_New/src/common/Logging/Log.h:23,
  50.                  from /home/grad/TBC_New/src/common/Collision/Models/GameObjectModel.cpp:26:
  51. /home/grad/TBC_New/src/common/Asio/AsioHacksFwd.h:55:15: error: redefinition of default argument for ‘class TimeTraits’
  52.    55 |         class basic_deadline_timer;
  53.       |               ^~~~~~~~~~~~~~~~~~~~
  54. In file included from /home/grad/TBC_New/src/common/Asio/AsioHacksFwd.h:23,
  55.                  from /home/grad/TBC_New/src/common/Logging/Log.h:23,
  56.                  from /home/grad/TBC_New/src/common/Collision/Models/GameObjectModel.cpp:26:
  57. /usr/include/boost/asio/basic_deadline_timer.hpp:128:5: note: original definition appeared here
  58.   128 |     typename TimeTraits = boost::asio::time_traits<Time>,
  59.       |     ^~~~~~~~
  60. [ 11%] Building CXX object src/common/CMakeFiles/common.dir/Collision/PrecompiledHeaders/collisionPCH.cpp.o
  61. [ 12%] Building CXX object src/common/CMakeFiles/common.dir/Configuration/BuiltInConfig.cpp.o
  62. [ 12%] Building CXX object src/common/CMakeFiles/common.dir/Configuration/Config.cpp.o
  63. make[2]: *** [src/common/CMakeFiles/common.dir/build.make:153: src/common/CMakeFiles/common.dir/Collision/DynamicTree.cpp.o] Ошибка 1
  64. make[2]: *** Ожидание завершения заданий…
  65. make[2]: *** [src/common/CMakeFiles/common.dir/build.make:209: src/common/CMakeFiles/common.dir/Collision/Management/VMapManager2.cpp.o] Ошибка 1
  66. make[2]: *** [src/common/CMakeFiles/common.dir/build.make:223: src/common/CMakeFiles/common.dir/Collision/Maps/MapTree.cpp.o] Ошибка 1
  67. make[2]: *** [src/common/CMakeFiles/common.dir/build.make:251: src/common/CMakeFiles/common.dir/Collision/Models/GameObjectModel.cpp.o] Ошибка 1
  68. make[2]: *** [src/common/CMakeFiles/common.dir/build.make:181: src/common/CMakeFiles/common.dir/Collision/Management/MMapManager.cpp.o] Ошибка 1
  69. In file included from /home/grad/TBC_New/src/common/Logging/Log.h:23,
  70.                  from /home/grad/TBC_New/src/common/Configuration/Config.cpp:25:
  71. /home/grad/TBC_New/src/common/Asio/AsioHacksFwd.h:55:15: error: redefinition of default argument for ‘class TimeTraits’
  72.    55 |         class basic_deadline_timer;
  73.       |               ^~~~~~~~~~~~~~~~~~~~
  74. In file included from /home/grad/TBC_New/src/common/Asio/AsioHacksFwd.h:23,
  75.                  from /home/grad/TBC_New/src/common/Logging/Log.h:23,
  76.                  from /home/grad/TBC_New/src/common/Configuration/Config.cpp:25:
  77. /usr/include/boost/asio/basic_deadline_timer.hpp:128:5: note: original definition appeared here
  78.   128 |     typename TimeTraits = boost::asio::time_traits<Time>,
  79.       |     ^~~~~~~~
  80. make[2]: *** [src/common/CMakeFiles/common.dir/build.make:321: src/common/CMakeFiles/common.dir/Configuration/Config.cpp.o] Ошибка 1
  81. make[1]: *** [CMakeFiles/Makefile2:934: src/common/CMakeFiles/common.dir/all] Ошибка 2
  82. make: *** [Makefile:149: all] Ошибка 2
  83.  

A PHP Error was encountered

Severity: Core Warning

Message: PHP Startup: Unable to load dynamic library 'mcrypt.so' (tried: /usr/lib/php/20170718/mcrypt.so (/usr/lib/php/20170718/mcrypt.so: cannot open shared object file: No such file or directory), /usr/lib/php/20170718/mcrypt.so.so (/usr/lib/php/20170718/mcrypt.so.so: cannot open shared object file: No such file or directory))

Filename: Unknown

Line Number: 0

Backtrace: