From grad, 11 Months ago, written in Plain Text.
Embed
  1. [ 11%] Building CXX object src/common/CMakeFiles/common.dir/Collision/Maps/TileAssembler.cpp.o
  2. [ 11%] Building CXX object src/common/CMakeFiles/common.dir/Collision/Models/GameObjectModel.cpp.o
  3. [ 11%] Building CXX object src/common/CMakeFiles/common.dir/Collision/Models/ModelInstance.cpp.o
  4. In file included from /home/grad/TBC_New/src/common/Logging/Log.h:23,
  5.                  from /home/grad/TBC_New/src/common/Collision/DynamicTree.cpp:24:
  6. /home/grad/TBC_New/src/common/Asio/AsioHacksFwd.h:50:9: error: expected unqualified-id before ‘namespace’
  7.    50 |         namespace ip
  8.       |         ^~~~~~~~~
  9. /home/grad/TBC_New/src/common/Asio/AsioHacksFwd.h:64:15: error: redefinition of default argument for ‘class TimeTraits’
  10.    64 |         class basic_deadline_timer
  11.       |               ^~~~~~~~~~~~~~~~~~~~
  12. In file included from /home/grad/TBC_New/src/common/Asio/AsioHacksFwd.h:31,
  13.                  from /home/grad/TBC_New/src/common/Logging/Log.h:23,
  14.                  from /home/grad/TBC_New/src/common/Collision/DynamicTree.cpp:24:
  15. /usr/include/boost/asio/basic_deadline_timer.hpp:128:5: note: original definition appeared here
  16.   128 |     typename TimeTraits = boost::asio::time_traits<Time>,
  17.       |     ^~~~~~~~
  18. In file included from /home/grad/TBC_New/src/common/Logging/Log.h:23,
  19.                  from /home/grad/TBC_New/src/common/Collision/DynamicTree.cpp:24:
  20. /home/grad/TBC_New/src/common/Asio/AsioHacksFwd.h:78:36: error: ‘tcp’ was not declared in this scope
  21.    78 |             typedef basic_resolver<tcp> tcp_resolver;
  22.       |                                    ^~~
  23. /home/grad/TBC_New/src/common/Asio/AsioHacksFwd.h:78:39: error: template argument 1 is invalid
  24.    78 |             typedef basic_resolver<tcp> tcp_resolver;
  25.       |                                       ^
  26. In file included from /home/grad/TBC_New/src/common/Logging/Log.h:23,
  27.                  from /home/grad/TBC_New/src/common/Collision/Maps/MapTree.cpp:23:
  28. /home/grad/TBC_New/src/common/Asio/AsioHacksFwd.h:50:9: error: expected unqualified-id before ‘namespace’
  29.    50 |         namespace ip
  30.       |         ^~~~~~~~~
  31. /home/grad/TBC_New/src/common/Asio/AsioHacksFwd.h:64:15: error: redefinition of default argument for ‘class TimeTraits’
  32.    64 |         class basic_deadline_timer
  33.       |               ^~~~~~~~~~~~~~~~~~~~
  34. In file included from /home/grad/TBC_New/src/common/Asio/AsioHacksFwd.h:31,
  35.                  from /home/grad/TBC_New/src/common/Logging/Log.h:23,
  36.                  from /home/grad/TBC_New/src/common/Collision/Maps/MapTree.cpp:23:
  37. /usr/include/boost/asio/basic_deadline_timer.hpp:128:5: note: original definition appeared here
  38.   128 |     typename TimeTraits = boost::asio::time_traits<Time>,
  39.       |     ^~~~~~~~
  40. In file included from /home/grad/TBC_New/src/common/Logging/Log.h:23,
  41.                  from /home/grad/TBC_New/src/common/Collision/Maps/MapTree.cpp:23:
  42. /home/grad/TBC_New/src/common/Asio/AsioHacksFwd.h:78:36: error: ‘tcp’ was not declared in this scope
  43.    78 |             typedef basic_resolver<tcp> tcp_resolver;
  44.       |                                    ^~~
  45. /home/grad/TBC_New/src/common/Asio/AsioHacksFwd.h:78:39: error: template argument 1 is invalid
  46.    78 |             typedef basic_resolver<tcp> tcp_resolver;
  47.       |                                       ^
  48. In file included from /home/grad/TBC_New/src/common/Logging/Log.h:23,
  49.                  from /home/grad/TBC_New/src/common/Collision/Management/VMapManager2.cpp:28:
  50. /home/grad/TBC_New/src/common/Asio/AsioHacksFwd.h:50:9: error: expected unqualified-id before ‘namespace’
  51.    50 |         namespace ip
  52.       |         ^~~~~~~~~
  53. /home/grad/TBC_New/src/common/Asio/AsioHacksFwd.h:64:15: error: redefinition of default argument for ‘class TimeTraits’
  54.    64 |         class basic_deadline_timer
  55.       |               ^~~~~~~~~~~~~~~~~~~~
  56. In file included from /home/grad/TBC_New/src/common/Asio/AsioHacksFwd.h:31,
  57.                  from /home/grad/TBC_New/src/common/Logging/Log.h:23,
  58.                  from /home/grad/TBC_New/src/common/Collision/Management/VMapManager2.cpp:28:
  59. /usr/include/boost/asio/basic_deadline_timer.hpp:128:5: note: original definition appeared here
  60.   128 |     typename TimeTraits = boost::asio::time_traits<Time>,
  61.       |     ^~~~~~~~
  62. In file included from /home/grad/TBC_New/src/common/Logging/Log.h:23,
  63.                  from /home/grad/TBC_New/src/common/Collision/Management/VMapManager2.cpp:28:
  64. /home/grad/TBC_New/src/common/Asio/AsioHacksFwd.h:78:36: error: ‘tcp’ was not declared in this scope
  65.    78 |             typedef basic_resolver<tcp> tcp_resolver;
  66.       |                                    ^~~
  67. /home/grad/TBC_New/src/common/Asio/AsioHacksFwd.h:78:39: error: template argument 1 is invalid
  68.    78 |             typedef basic_resolver<tcp> tcp_resolver;
  69.       |                                       ^
  70. In file included from /home/grad/TBC_New/src/common/Logging/Log.h:23,
  71.                  from /home/grad/TBC_New/src/common/Collision/Management/MMapManager.cpp:20:
  72. /home/grad/TBC_New/src/common/Asio/AsioHacksFwd.h:50:9: error: expected unqualified-id before ‘namespace’
  73.    50 |         namespace ip
  74.       |         ^~~~~~~~~
  75. /home/grad/TBC_New/src/common/Asio/AsioHacksFwd.h:64:15: error: redefinition of default argument for ‘class TimeTraits’
  76.    64 |         class basic_deadline_timer
  77.       |               ^~~~~~~~~~~~~~~~~~~~
  78. In file included from /home/grad/TBC_New/src/common/Asio/AsioHacksFwd.h:31,
  79.                  from /home/grad/TBC_New/src/common/Logging/Log.h:23,
  80.                  from /home/grad/TBC_New/src/common/Collision/Management/MMapManager.cpp:20:
  81. /usr/include/boost/asio/basic_deadline_timer.hpp:128:5: note: original definition appeared here
  82.   128 |     typename TimeTraits = boost::asio::time_traits<Time>,
  83.       |     ^~~~~~~~
  84. In file included from /home/grad/TBC_New/src/common/Logging/Log.h:23,
  85.                  from /home/grad/TBC_New/src/common/Collision/Management/MMapManager.cpp:20:
  86. /home/grad/TBC_New/src/common/Asio/AsioHacksFwd.h:78:36: error: ‘tcp’ was not declared in this scope
  87.    78 |             typedef basic_resolver<tcp> tcp_resolver;
  88.       |                                    ^~~
  89. /home/grad/TBC_New/src/common/Asio/AsioHacksFwd.h:78:39: error: template argument 1 is invalid
  90.    78 |             typedef basic_resolver<tcp> tcp_resolver;
  91.       |                                       ^
  92. [ 11%] Building CXX object src/common/CMakeFiles/common.dir/Collision/Models/WorldModel.cpp.o
  93. In file included from /home/grad/TBC_New/src/common/Logging/Log.h:23,
  94.                  from /home/grad/TBC_New/src/common/Collision/Models/GameObjectModel.cpp:26:
  95. /home/grad/TBC_New/src/common/Asio/AsioHacksFwd.h:50:9: error: expected unqualified-id before ‘namespace’
  96.    50 |         namespace ip
  97.       |         ^~~~~~~~~
  98. /home/grad/TBC_New/src/common/Asio/AsioHacksFwd.h:64:15: error: redefinition of default argument for ‘class TimeTraits’
  99.    64 |         class basic_deadline_timer
  100.       |               ^~~~~~~~~~~~~~~~~~~~
  101. In file included from /home/grad/TBC_New/src/common/Asio/AsioHacksFwd.h:31,
  102.                  from /home/grad/TBC_New/src/common/Logging/Log.h:23,
  103.                  from /home/grad/TBC_New/src/common/Collision/Models/GameObjectModel.cpp:26:
  104. /usr/include/boost/asio/basic_deadline_timer.hpp:128:5: note: original definition appeared here
  105.   128 |     typename TimeTraits = boost::asio::time_traits<Time>,
  106.       |     ^~~~~~~~
  107. In file included from /home/grad/TBC_New/src/common/Logging/Log.h:23,
  108.                  from /home/grad/TBC_New/src/common/Collision/Models/GameObjectModel.cpp:26:
  109. /home/grad/TBC_New/src/common/Asio/AsioHacksFwd.h:78:36: error: ‘tcp’ was not declared in this scope
  110.    78 |             typedef basic_resolver<tcp> tcp_resolver;
  111.       |                                    ^~~
  112. /home/grad/TBC_New/src/common/Asio/AsioHacksFwd.h:78:39: error: template argument 1 is invalid
  113.    78 |             typedef basic_resolver<tcp> tcp_resolver;
  114.       |                                       ^
  115. [ 12%] Building CXX object src/common/CMakeFiles/common.dir/Configuration/BuiltInConfig.cpp.o
  116. [ 12%] Building CXX object src/common/CMakeFiles/common.dir/Collision/PrecompiledHeaders/collisionPCH.cpp.o
  117. make[2]: *** [src/common/CMakeFiles/common.dir/build.make:153: src/common/CMakeFiles/common.dir/Collision/DynamicTree.cpp.o] Ошибка 1
  118. make[2]: *** Ожидание завершения заданий…
  119. make[2]: *** [src/common/CMakeFiles/common.dir/build.make:223: src/common/CMakeFiles/common.dir/Collision/Maps/MapTree.cpp.o] Ошибка 1
  120. make[2]: *** [src/common/CMakeFiles/common.dir/build.make:209: src/common/CMakeFiles/common.dir/Collision/Management/VMapManager2.cpp.o] Ошибка 1
  121. make[2]: *** [src/common/CMakeFiles/common.dir/build.make:251: src/common/CMakeFiles/common.dir/Collision/Models/GameObjectModel.cpp.o] Ошибка 1
  122. make[2]: *** [src/common/CMakeFiles/common.dir/build.make:181: src/common/CMakeFiles/common.dir/Collision/Management/MMapManager.cpp.o] Ошибка 1
  123. make[1]: *** [CMakeFiles/Makefile2:934: src/common/CMakeFiles/common.dir/all] Ошибка 2
  124. make: *** [Makefile:149: all] Ошибка 2
  125.  

A PHP Error was encountered

Severity: Core Warning

Message: PHP Startup: Unable to load dynamic library 'mcrypt.so' (tried: /usr/lib/php/20170718/mcrypt.so (/usr/lib/php/20170718/mcrypt.so: cannot open shared object file: No such file or directory), /usr/lib/php/20170718/mcrypt.so.so (/usr/lib/php/20170718/mcrypt.so.so: cannot open shared object file: No such file or directory))

Filename: Unknown

Line Number: 0

Backtrace: